{"text_format":"1","workbook":"xlsx","n_sheets":8,"sheets":["1. INSTRUCTIONS","2. Master Adhesive List","3. Master Solvent List","4. Adhesive Reporting Form","5. Solvent Reprting Form","6. APCD Limits","Drop Down List 2","Drop Down list 1"],"not_rendered":{"charts":0,"images":1,"macros":1,"external_links":2,"defined_names":43,"comments":1,"pivot_tables":0},"unopened":[],"bounds":{"document_bytes":16777216,"sheet_cells":100000,"rows_first":2000,"rows_last":500,"rows_between":2000,"halvings":0,"cell_chars":16384,"cell_head_chars":4096},"cells_cut":0,"cells_raw":0,"read":"whole","date_system":"1900"}

{"sheet":"1. INSTRUCTIONS","index":0,"n_rows":69,"n_cols":11,"rows_kept":69,"cut":false,"hidden":false,"merged":[[5,1,5,9],[6,1,6,9],[7,7,7,9],[8,1,8,5],[8,7,8,9],[43,0,43,3],[43,4,43,5],[43,6,43,9],[43,10,43,12],[9,1,9,5],[9,7,9,9],[42,0,42,3],[42,4,42,5],[42,6,42,9],[40,0,40,3],[40,4,40,5],[40,6,40,9],[38,0,38,3],[38,4,38,5],[38,6,38,9],[13,1,13,15],[41,0,41,3],[41,4,41,5],[41,6,41,9],[41,10,41,12],[42,10,42,12],[39,0,39,3],[39,4,39,5],[39,6,39,9],[39,10,39,12],[40,10,40,12],[18,1,18,15],[22,1,22,15],[25,1,25,15],[7,1,7,5],[38,10,38,12],[30,1,30,15],[14,1,14,15],[32,1,32,15],[15,1,15,15]]}
[]
[]
[null,null,null,null,"INSTRUCTIONS FOR COMPLETION OF THE ADHESIVE MONTHLY REPORTING FORM"]
[]
["1)  Provide Identifying Information About the Company Applying Adhesives:"]
["Company Name"]
["Address"]
["City, zip code",null,null,null,null,null,"Phone"]
["Reported by: Name/Title",null,null,null,null,null,"E-Mail"]
[null,null,null,null,null,null,"Report Date"]
[]
[]
["A. Overview of Reporting Requirement"]
["1)","Any company that uses/applies adhesives or performs associated surface preparation, equipment cleanup, or stripping at naval or contractor  facilities is required to submit monthly reports of materials used."]
["2) ","Users of adhesive products are responsible for verifying that all adhesive products comply with the San Diego Air Pollution Control District's Rule 67.21.  User must indicate the product category applicable to each product in their monthly report."]
["3)","Before any adhesive or solvent product is first used at facilities, an MSDS must be submitted to the SWRMC EHS Department for Review.  Please contact the SWRMC Dept at 556-1056 or 556-9153 for more information."]
[]
["B. Master Product List"]
["1)","Enter each adhesive and solvent product on the \"MASTER PRODUCT LIST\" once.  Indicate specific product name by manufacturer. List all adhesive products used at naval facilities except those specifically exempt by Rule 67.21 (for example - do not include adhesives packaged in aerosol spray cans, those used exclusively in containers holding 16 ounces or less of material, or those products containing less than 20 g/l VOC)"]
["2)","Enter the product VOC content and units. This information can be found on the product data sheet, MSDS, or packaging."]
["3)","Describe the surface that the adhesive will be used on (e.g., wood, metal, etc.)"]
["4)","Select the applicable category San Diego Air Pollution Control District Rule 67.21"]
["5)","The \"MASTER PRODUCT LIST\" allows the user to enter each product to be used only once, serving to reduce data entry time on subsequent monthly reports. Once the \"MASTER PRODUCT LIST\" has been populated, it will become the source of \"pull down lists\" for the Monthly Reporting form.  "]
[]
["B. Completing the Monthly Reporting Form"]
["1)","Each month that adhesives are used any facility, an \"ADHESIVE REPORTING FORM\" must be submitted. This report shall contain a summary of the TOTAL amount of each adhesive used during the month.  "]
["2)","If the \"MASTER PRODUCT LIST\" has been populated, simply select the product from the pull down menu.   Otherwise, enter the required product information on the form. "]
["3)","Enter the total amount of each product used."]
[]
["C. Submitting the Monthly Reporting Form"]
["1)","Material Usage Reports are due on the 10th of each month, following the reporting month (e.g., for material used during the month of February, the report is due by March 10th). "]
["2)","Send a copy of the monthly report to the SWRMC EHS Department at SWRMCC106B@navy.mil or Fax to 619-556-7887."]
[null,"\n"]
[]
["D.  For More Information"]
[null,"For more information about monthly reporting requirements, contact the SWRMC EHS Department at 556-1056 or 556-9153."]
[]
[]
["Facility",null,null,null,null,null,"Reports Due by",null,null,null,"Submit Reports to"]
["Amphibious Base Coronado (AMPHIB) ",null,null,null,"Jess Goodrich (619) 556-9153     or       Paul Clifford (619) 556-2864",null,"10th of the month following the month when coating occurred",null,null,null,"swrmcc106b@navy.mil"]
["Marine Core Base Camp Pendleton (MCBCP)",null,null,null,"Jess Goodrich (619) 556-9153     or       Paul Clifford (619) 556-2865",null,"10th of the month following the month when coating occurred",null,null,null,"swrmcc106b@navy.mil"]
["Naval Base Point Loma (NBPL)",null,null,null,"Jess Goodrich (619) 556-9153     or       Paul Clifford (619) 556-2866",null,"10th of the month following the month when coating occurred",null,null,null,"swrmcc106b@navy.mil"]
["Naval Base Coronado (NBC)",null,null,null,"Jess Goodrich (619) 556-9153     or       Paul Clifford (619) 556-2867",null,"10th of the month following the month when coating occurred",null,null,null,"swrmcc106b@navy.mil"]
["Naval Base San Diego (NBSD)",null,null,null,"Jess Goodrich (619) 556-9153     or       Paul Clifford (619) 556-2868",null,"10th of the month following the month when coating occurred",null,null,null,"swrmcc106b@navy.mil"]
[]
["Pull Down Lists for Worksheets - Do Not Modify or Delete"]
[]
["Reporting Years",null,null,null,"Facility"]
[2009,null,null,null,"GD NASSCO 28th and Harbor Drive"]
[2010,null,null,null,"Naval Station San Diego (32nd Street)"]
[2011,null,null,null,"BAE Systems"]
[2012,null,null,null,"Naval Station North Island"]
[2013,null,null,null,"Northrup Grumman (CMSD)"]
[2014]
[]
[]
["Reporting Months",null,null,null,"Unit"]
["January",null,null,null,"lb/gallon"]
["February",null,null,null,"gram/liter"]
["March"]
["April"]
["May"]
["June"]
["July"]
["August"]
["September"]
["October"]
["November"]
["December"]

{"sheet":"2. Master Adhesive List","index":1,"n_rows":62,"n_cols":8,"rows_kept":62,"cut":false,"hidden":false,"merged":[]}
[]
[]
[]
[]
[]
[]
[]
[]
["MASTER PRODUCT LIST - ADHESIVES"]
[]
["Adhesive Product Name","Product Manufacturer","VOC Content of Product (as applied)","Unit","Surface Applied To (Substrate)","Product Classification from APCD Rule 67.21","Product VOC in g/l","APCD VOC Limit"]
[2033,"Taylor",0,"grams/liter","X","< 20 g/l VOC, FOR USGAE RECORDS ONLY",0,{"$f":"VLOOKUP(F12,'[2]6. APCD Limits'!$D$11:$E$62,2,FALSE)","v":20}]
[4099,"Parabond",1,"grams/liter","X","< 20 g/l VOC, FOR USGAE RECORDS ONLY",1,{"$f":"VLOOKUP(F13,'[2]6. APCD Limits'!$D$11:$E$62,2,FALSE)","v":20}]
[847,"3M",0,"grams/liter","X","< 20 g/l VOC, FOR USGAE RECORDS ONLY",0,{"$f":"VLOOKUP(F14,'[2]6. APCD Limits'!$D$11:$E$62,2,FALSE)","v":20}]
["1290 Ultra Lt Underlayment","EPMAR",0,"grams/liter","X","< 20 g/l VOC, FOR USGAE RECORDS ONLY",0,{"$f":"VLOOKUP(F15,'[2]6. APCD Limits'!$D$11:$E$62,2,FALSE)","v":20}]
["250ML DEPEND 330 FILLED WIP   ","HENKEL CORP.",18.399999999999999,"grams/liter","X","< 20 g/l VOC, FOR USGAE RECORDS ONLY",{"$f":"IF(C16>1,(IF(D16=\"pounds/gallon\",C16*120,C16)),\" \")","v":18.399999999999999},{"$f":"VLOOKUP(F16,'[2]6. APCD Limits'!$D$11:$E$62,2,FALSE)","v":20}]
["AC-665 B","AC Tech",15,"grams/liter","X","< 20 g/l VOC, FOR USGAE RECORDS ONLY",{"$f":"IF(C17>1,(IF(D17=\"pounds/gallon\",C17*120,C17)),\" \")","v":15},{"$f":"VLOOKUP(F17,'[2]6. APCD Limits'!$D$11:$E$62,2,FALSE)","v":20}]
["Aerospace Sealant AC-665 C-12 Part A and B (mixed 100 : 10 volume)","3M",48,"grams/liter","X","Sealant",{"$f":"IF(C18>1,(IF(D18=\"pounds/gallon\",C18*120,C18)),\" \")","v":48},{"$f":"VLOOKUP(F18,'[2]6. APCD Limits'!$D$11:$E$62,2,FALSE)","v":420}]
["Aerospace Sealant AC-665 C-48 Part A and B (mixed 100:10 by  volume)","3M",48,"grams/liter","X","Sealant",{"$f":"IF(C19>1,(IF(D19=\"pounds/gallon\",C19*120,C19)),\" \")","v":48},{"$f":"VLOOKUP(F19,'[2]6. APCD Limits'!$D$11:$E$62,2,FALSE)","v":420}]
["Alex Plus Clear (Latex Caulk)","DAP Inc.",44.4,"grams/liter","X","Sealant",44.4,{"$f":"VLOOKUP(F20,'[2]6. APCD Limits'!$D$11:$E$62,2,FALSE)","v":420}]
["Armaflex 520","Armacell LLC",596,"grams/liter","X","Container < 16 oz/1 lb, FOR USAGE RECORDS ONLY",{"$f":"IF(C21>1,(IF(D21=\"pounds/gallon\",C21*120,C21)),\" \")","v":596},{"$f":"VLOOKUP(F21,'[2]6. APCD Limits'!$D$11:$E$62,2,FALSE)","v":"X"}]
["Armaflex 520 BLV","Armacell LLC",0,"grams/liter","X","< 20 g/l VOC, FOR USGAE RECORDS ONLY",0,{"$f":"VLOOKUP(F22,'[2]6. APCD Limits'!$D$11:$E$62,2,FALSE)","v":20}]
["CP-25WB Fire Barrier","3M",1,"grams/liter","X","< 20 g/l VOC, FOR USGAE RECORDS ONLY",1,{"$f":"VLOOKUP(F23,'[2]6. APCD Limits'!$D$11:$E$62,2,FALSE)","v":20}]
["CS 3204 (class A) Part A and B (mixed 100:8.3 by volume)","Chem Seal",129.30000000000001,"grams/liter","X","Sealant",{"$f":"IF(C24>1,(IF(D24=\"pounds/gallon\",C24*120,C24)),\" \")","v":129.30000000000001},{"$f":"VLOOKUP(F24,'[2]6. APCD Limits'!$D$11:$E$62,2,FALSE)","v":420}]
["CS 3204 (class B) Part A and B (mixed 100:8.3 by volume)","Chem Seal",12,"grams/liter","X","< 20 g/l VOC, FOR USGAE RECORDS ONLY",{"$f":"IF(C25>1,(IF(D25=\"pounds/gallon\",C25*120,C25)),\" \")","v":12},{"$f":"VLOOKUP(F25,'[2]6. APCD Limits'!$D$11:$E$62,2,FALSE)","v":20}]
["CS 3213 (class A) Type I Part A and B (mixed 100:14 by volume)","Chem Seal",157,"grams/liter","X","Sealant",{"$f":"IF(C26>1,(IF(D26=\"pounds/gallon\",C26*120,C26)),\" \")","v":157},{"$f":"VLOOKUP(F26,'[2]6. APCD Limits'!$D$11:$E$62,2,FALSE)","v":420}]
["CS 3213 (class B) Type II Part A and B (mixed 100:14 by volume)","Chem Seal",11.4,"grams/liter","X","Sealant",{"$f":"IF(C27>1,(IF(D27=\"pounds/gallon\",C27*120,C27)),\" \")","v":11.4},{"$f":"VLOOKUP(F27,'[2]6. APCD Limits'!$D$11:$E$62,2,FALSE)","v":420}]
["Degaseal 22","BASF",35,"grams/liter","X","EXEMPT FROM RULE 67.21, < 20 g/l VOC, FOR USGAE RECORDS ONLY",{"$f":"IF(C28>1,(IF(D28=\"pounds/gallon\",C28*120,C28)),\" \")","v":35},420]
["Dow Corning R732","Dow Corning",0.3,"grams/liter","X","< 20 g/l VOC, FOR USGAE RECORDS ONLY",0.3,{"$f":"VLOOKUP(F29,'[2]6. APCD Limits'!$D$11:$E$62,2,FALSE)","v":20}]
["DP-77 (industrial spray adhesive)","DESIGN POLYMERICS",0,"grams/liter","X","Aerosol",0,{"$f":"VLOOKUP(F30,'[2]6. APCD Limits'!$D$11:$E$62,2,FALSE)","v":"X"}]
["E-6100","Eclectic Products Inc.",0.02,"lbs/gal","X","< 20 g/l VOC, FOR USGAE RECORDS ONLY",0.02,{"$f":"VLOOKUP(F31,'[2]6. APCD Limits'!$D$11:$E$62,2,FALSE)","v":20}]
["Fastbond Cantact Adhesive 30-NF","3M",37,"grams/liter","X","Contact Adhesive - General",{"$f":"IF(C32>1,(IF(D32=\"pounds/gallon\",C32*120,C32)),\" \")","v":37},{"$f":"VLOOKUP(F32,'[2]6. APCD Limits'!$D$11:$E$62,2,FALSE)","v":80}]
["Fosters 30-36","H.B. Fuller",15,"grams/liter","X","EXEMPT FROM RULE 67.21, < 20 g/l VOC, FOR USGAE RECORDS ONLY",{"$f":"IF(C33>1,(IF(D33=\"pounds/gallon\",C33*120,C33)),\" \")","v":15},420]
["Fosters SEALFAS 30-36 AF","Specialty Construction Brands Inc.",48,"grams/liter","X","Porous material (except wood)",{"$f":"IF(C34>1,(IF(D34=\"pounds/gallon\",C34*120,C34)),\" \")","v":48},{"$f":"VLOOKUP(F34,'[2]6. APCD Limits'!$D$11:$E$62,2,FALSE)","v":50}]
["Fosters SEALFAS 81-27","Specialty Construction Brands Inc.",0,"grams/liter","X","< 20 g/l VOC, FOR USGAE RECORDS ONLY",0,{"$f":"VLOOKUP(F35,'[2]6. APCD Limits'!$D$11:$E$62,2,FALSE)","v":20}]
["KR421 (mixed 100:6 by weight)","Uzin",49.9,"grams/liter","X","Flooring adhesives:Indoor carpet or carpet pad adhesive",{"$f":"IF(C36>1,(IF(D36=\"pounds/gallon\",C36*120,C36)),\" \")","v":49.9},{"$f":"VLOOKUP(F36,'[2]6. APCD Limits'!$D$11:$E$62,2,FALSE)","v":50}]
["NEGATIVE REPORT (No Adhesives Applied)","X",0,"X","X",null,0,{"$f":"VLOOKUP(F37,'[2]6. APCD Limits'!$D$11:$E$62,2,FALSE)","v":0}]
["Philly Clad 5066A H","ITW Philadelphia Resins",0,"grams/liter","X","< 20 g/l VOC, FOR USGAE RECORDS ONLY",0,{"$f":"VLOOKUP(F38,'[2]6. APCD Limits'!$D$11:$E$62,2,FALSE)","v":20}]
["Philly Clad 5066A R","ITW Philadelphia Resins",0,"grams/liter","X","< 20 g/l VOC, FOR USGAE RECORDS ONLY",0,{"$f":"VLOOKUP(F39,'[2]6. APCD Limits'!$D$11:$E$62,2,FALSE)","v":20}]
["Pro Seal 870 A-1/2 Part A and B (mixed 17:100 by volume)","PPG Industries Inc.",194,"grams/liter","X","Sealant",{"$f":"IF(C40>1,(IF(D40=\"pounds/gallon\",C40*120,C40)),\" \")","v":194},{"$f":"VLOOKUP(F40,'[2]6. APCD Limits'!$D$11:$E$62,2,FALSE)","v":420}]
["Pro Seal 870 A-2 Part A and B (mixed 17:100  by volume)","PPG Industries Inc.",194,"grams/liter","X","Sealant",{"$f":"IF(C41>1,(IF(D41=\"pounds/gallon\",C41*120,C41)),\" \")","v":194},{"$f":"VLOOKUP(F41,'[2]6. APCD Limits'!$D$11:$E$62,2,FALSE)","v":420}]
["Pro Seal 870 B-1/2 Part A and B (mixed ratio by 17:100 volume)","PPG Industries Inc.",82,"grams/liter","X","Sealant",82,{"$f":"VLOOKUP(F42,'[2]6. APCD Limits'!$D$11:$E$62,2,FALSE)","v":420}]
["Pro Seal 870 B-2 Part A and B (mixed ratio 17:100  by volume)","PPG Industries Inc.",55,"grams/liter","X","Sealant",55,{"$f":"VLOOKUP(F43,'[2]6. APCD Limits'!$D$11:$E$62,2,FALSE)","v":420}]
["Pro Seal 870 C-12 Part A and B (mixed ratio by 17:100 volume)","PPG Industries Inc.",118,"grams/liter","X","Sealant",{"$f":"IF(C44>1,(IF(D44=\"pounds/gallon\",C44*120,C44)),\" \")","v":118},{"$f":"VLOOKUP(F44,'[2]6. APCD Limits'!$D$11:$E$62,2,FALSE)","v":420}]
["Pro Seal 870 C-24 Part A and B (mixed ratio by 17:100 volume)","PPG Industries Inc.",118,"grams/liter","X","Sealant",{"$f":"IF(C45>1,(IF(D45=\"pounds/gallon\",C45*120,C45)),\" \")","v":118},{"$f":"VLOOKUP(F45,'[2]6. APCD Limits'!$D$11:$E$62,2,FALSE)","v":420}]
["Pro Seal 870 C-48 Part A and B (mixed ratio by 17:100 volume)","PPG Industries Inc.",118,"grams/liter","X","Sealant",{"$f":"IF(C46>1,(IF(D46=\"pounds/gallon\",C46*120,C46)),\" \")","v":118},{"$f":"VLOOKUP(F46,'[2]6. APCD Limits'!$D$11:$E$62,2,FALSE)","v":420}]
["Pro Seal 890 A-1/2 Part A and B (mixed ratio 10:100 by volume)","PPG Industries Inc.",203,"grams/liter","X","Sealant",203,{"$f":"VLOOKUP(F47,'[2]6. APCD Limits'!$D$11:$E$62,2,FALSE)","v":420}]
["Pro Seal 890 A-2 Part A and B (mixed ratio 10:100 by volume)","PPG Industries Inc.",203,"grams/liter","X","Sealant",{"$f":"IF(C48>1,(IF(D48=\"pounds/gallon\",C48*120,C48)),\" \")","v":203},{"$f":"VLOOKUP(F48,'[2]6. APCD Limits'!$D$11:$E$62,2,FALSE)","v":420}]
["Pro Seal 890 B-2 Part A and B (mixed ratio 10:100 by volume)","PPG Industries Inc.",53,"grams/liter","X","Sealant",53,{"$f":"VLOOKUP(F49,'[2]6. APCD Limits'!$D$11:$E$62,2,FALSE)","v":420}]
["Pro Seal 890 C-20 Part A and B (mixed ratio 10:100 by volume)","PPG Industries Inc.",82,"grams/liter","X","Sealant",{"$f":"IF(C50>1,(IF(D50=\"pounds/gallon\",C50*120,C50)),\" \")","v":82},{"$f":"VLOOKUP(F50,'[2]6. APCD Limits'!$D$11:$E$62,2,FALSE)","v":420}]
["RTV 1473 Acetoxy Curing Sealant","Momentive Performance Materials",26,"grams/liter","X","Sealant",26,{"$f":"VLOOKUP(F51,'[2]6. APCD Limits'!$D$11:$E$62,2,FALSE)","v":420}]
["Safety-Walk(Brand Edge Sealing Compound)","3M",481,"grams/liter","X","Container < 16 oz/1 lb, FOR USAGE RECORDS ONLY",481,{"$f":"VLOOKUP(F52,'[2]6. APCD Limits'!$D$11:$E$62,2,FALSE)","v":"X"}]
["Scotch-Seal Industrial Sealant 800","3M",485,"grams/liter","X","Container < 16 oz/1 lb, FOR USAGE RECORDS ONLY",485,{"$f":"VLOOKUP(F53,'[2]6. APCD Limits'!$D$11:$E$62,2,FALSE)","v":"X"}]
["Scotch-Weld 1838 Green part A and B (mixed ratio 4:5 by volume)","3M",3.4,"grams/liter","X","< 20 g/l VOC, FOR USGAE RECORDS ONLY",3.4,{"$f":"VLOOKUP(F54,'[2]6. APCD Limits'!$D$11:$E$62,2,FALSE)","v":20}]
["Scotch-Weld 2216 Gray part A and B (mixed ratio 2:3 by volume)","3M",12,"grams/liter","X","< 20 g/l VOC, FOR USGAE RECORDS ONLY",12,{"$f":"VLOOKUP(F55,'[2]6. APCD Limits'!$D$11:$E$62,2,FALSE)","v":20}]
["SF-400","Henkel Consumer",3.09,"grams/liter","X","< 20 g/l VOC, FOR USGAE RECORDS ONLY",3.09,{"$f":"VLOOKUP(F56,'[2]6. APCD Limits'!$D$11:$E$62,2,FALSE)","v":20}]
["Splash Zone Compound 4545 part A and B (mixed ratio 1:1 by volume)","Proline Paint Co.",0,"grams/liter","X","< 20 g/l VOC, FOR USGAE RECORDS ONLY",0,{"$f":"VLOOKUP(F57,'[2]6. APCD Limits'!$D$11:$E$62,2,FALSE)","v":20}]
["SS 5501","EPMAR",0,"grams/liter","X","< 20 g/l VOC, FOR USGAE RECORDS ONLY",0,{"$f":"VLOOKUP(F58,'[2]6. APCD Limits'!$D$11:$E$62,2,FALSE)","v":20}]
["Super 77","3M",468,"grams/liter","X","EXEMPT FROM RULE 67.21, Aerosol",{"$f":"IF(C59>1,(IF(D59=\"pounds/gallon\",C59*120,C59)),\" \")","v":468},"X"]
["Vimasco 713 and 713R (WHITE and RED)","Vimasco Corporation",0,"grams/liter","X","< 20 g/l VOC, FOR USGAE RECORDS ONLY",0,{"$f":"VLOOKUP(F60,'[2]6. APCD Limits'!$D$11:$E$62,2,FALSE)","v":20}]
["Vimasco 713 IMO/CA (WHITE and RED)","Vimasco Corporation",0.13,"grams/liter","X","< 20 g/l VOC, FOR USGAE RECORDS ONLY",0.13,{"$f":"VLOOKUP(F61,'[2]6. APCD Limits'!$D$11:$E$62,2,FALSE)","v":20}]
["Vimasco 760 High Temperature Adhesive","Vimasco Corporation",0,"grams/liter","X","< 20 g/l VOC, FOR USGAE RECORDS ONLY",0,{"$f":"VLOOKUP(F62,'[2]6. APCD Limits'!$D$11:$E$62,2,FALSE)","v":20}]

{"sheet":"3. Master Solvent List","index":2,"n_rows":107,"n_cols":26,"rows_kept":107,"cut":false,"hidden":false,"merged":[]}
[]
[]
[]
[]
[]
[]
[]
[]
["MASTER PRODUCT LIST - SOLVENTS"]
[]
["Solvent Used for:","Solvent Manufacturer Name","Solvent Name","Product ID","Composite Solvent Name","VOC Content","Unit","g/liter ","VOC Limit (g/L)","Meets VOC Limit?","Vapor Pressure (mm/hg)","Vapor Pressure Limit","Meets Vapor Pressure Limit?","Initial Boiling Point","Boiling Point Unit","C ","IBP Limit (Degrees C)","Meets IBP Limit?","Complies with Numeric Limits?","Alt Compliance Needed?","Alternate Method of Compliance                                                     (VOC reduction measures must be used for any equipment cleaning solvent NOT meeting numeric limits; see SDAPCD Rule 67.18 (D)(3).  If highlighted Orange, indicate method to","Solvent Density (lbs/gal)","n-butanol (%)","n-butanol content (lbs/gal)","Mixed Xylenes (%)","Mixed Xylenes content (lbs/gal)"]
["Equipment Cleaning","Brenntag Pacific","40/60 MEK/MIBK Wipe Solvent",628893,{"$f":"IF(ISBLANK(B12),\" \",CONCATENATE($A12,\": \",$B12,\" \",$C12,\" \",$D12))","v":"Equipment Cleaning: Brenntag Pacific 40/60 MEK/MIBK Wipe Solvent 628893"},802,"g/l",{"$f":"IF($G12 = \"lb/gal\",($F12*120),$F12)","v":802},{"$f":"IF(H12>1,VLOOKUP($A12,'[1]Marine Coating Limits'!$I$3:$L$4,2,FALSE),0)","v":200},{"$f":"IF(H12>0.001,IF($H12>$I12,0,1),0)","v":0},41.9,{"$f":"IF(K12>0.01,VLOOKUP(A12,'[1]Marine Coating Limits'!$I$3:$L$4,4,FALSE),0)","v":20},{"$f":"IF(K12>0.0001,IF(K12>L12,0,1),0)","v":0},174,"F",{"$f":"IF($O12 = \"F\",CONVERT($N12,\"F\",\"C\"),$N12)","v":78.888888888888886},{"$f":"IF(P12>0.01,VLOOKUP(A12,'[1]Marine Coating Limits'!$I$3:$L$4,3,FALSE),0)","v":190},{"$f":"IF(P12>0.001,IF(P12>Q12,1,0),0)","v":0},{"$f":"IF(ISBLANK(C12),\" \",IF((H12+K12+N12) >0.001,IF((J12+M12+R12)>=1,\"YES\",\"NO\"),\"INCOMPLETE INFORMATION\"))","v":"NO"},{"$f":"IF(ISBLANK(N12),0,IF(S12=\"YES\",0,IF(A12 = \"Equipment Cleaning\",1,0)))","v":1},"Contained Flushing: cleaning solvent is flushed or rinsed through equipment in a contained manner as described in 67.18(d)(3)(ii)",null,null,{"$f":"IF(ISBLANK(W12),0,V12*W12/100)","v":0},null,{"$f":"IF(ISBLANK(Y12),0,V12*Y12/100)","v":0}]
["Equipment Cleaning","Brenntag Pacific","INTERN'L THINNER","GT 4637",{"$f":"IF(ISBLANK(B13),\" \",CONCATENATE($A13,\": \",$B13,\" \",$C13,\" \",$D13))","v":"Equipment Cleaning: Brenntag Pacific INTERN'L THINNER GT 4637"},7.23,"lb/gal",{"$f":"IF($G13 = \"lb/gal\",($F13*120),$F13)","v":867.6},{"$f":"IF(H13>1,VLOOKUP($A13,'[1]Marine Coating Limits'!$I$3:$L$4,2,FALSE),0)","v":200},{"$f":"IF(H13>0.001,IF($H13>$I13,0,1),0)","v":0},5.6,{"$f":"IF(K13>0.01,VLOOKUP(A13,'[1]Marine Coating Limits'!$I$3:$L$4,4,FALSE),0)","v":20},{"$f":"IF(K13>0.0001,IF(K13>L13,0,1),0)","v":1},330,"F",{"$f":"IF($O13 = \"F\",CONVERT($N13,\"F\",\"C\"),$N13)","v":165.55555555555554},{"$f":"IF(P13>0.01,VLOOKUP(A13,'[1]Marine Coating Limits'!$I$3:$L$4,3,FALSE),0)","v":190},{"$f":"IF(P13>0.001,IF(P13>Q13,1,0),0)","v":0},{"$f":"IF(ISBLANK(C13),\" \",IF((H13+K13+N13) >0.001,IF((J13+M13+R13)>=1,\"YES\",\"NO\"),\"INCOMPLETE INFORMATION\"))","v":"YES"},{"$f":"IF(ISBLANK(N13),0,IF(S13=\"YES\",0,IF(A13 = \"Equipment Cleaning\",1,0)))","v":0},null,null,null,{"$f":"IF(ISBLANK(W13),0,V13*W13/100)","v":0},null,{"$f":"IF(ISBLANK(Y13),0,V13*Y13/100)","v":0}]
["Equipment Cleaning","Brenntag Pacific","Lacquer Wash","201-X",{"$f":"IF(ISBLANK(B14),\" \",CONCATENATE($A14,\": \",$B14,\" \",$C14,\" \",$D14))","v":"Equipment Cleaning: Brenntag Pacific Lacquer Wash 201-X"},622,"g/l",{"$f":"IF($G14 = \"lb/gal\",($F14*120),$F14)","v":622},{"$f":"IF(H14>1,VLOOKUP($A14,'[1]Marine Coating Limits'!$I$3:$L$4,2,FALSE),0)","v":200},{"$f":"IF(H14>0.001,IF($H14>$I14,0,1),0)","v":0},37.200000000000003,{"$f":"IF(K14>0.01,VLOOKUP(A14,'[1]Marine Coating Limits'!$I$3:$L$4,4,FALSE),0)","v":20},{"$f":"IF(K14>0.0001,IF(K14>L14,0,1),0)","v":0},133,"F",{"$f":"IF($O14 = \"F\",CONVERT($N14,\"F\",\"C\"),$N14)","v":56.111111111111107},{"$f":"IF(P14>0.01,VLOOKUP(A14,'[1]Marine Coating Limits'!$I$3:$L$4,3,FALSE),0)","v":190},{"$f":"IF(P14>0.001,IF(P14>Q14,1,0),0)","v":0},{"$f":"IF(ISBLANK(C14),\" \",IF((H14+K14+N14) >0.001,IF((J14+M14+R14)>=1,\"YES\",\"NO\"),\"INCOMPLETE INFORMATION\"))","v":"NO"},{"$f":"IF(ISBLANK(N14),0,IF(S14=\"YES\",0,IF(A14 = \"Equipment Cleaning\",1,0)))","v":1},"Contained Flushing: cleaning solvent is flushed or rinsed through equipment in a contained manner as described in 67.18(d)(3)(ii)",null,null,{"$f":"IF(ISBLANK(W14),0,V14*W14/100)","v":0},null,{"$f":"IF(ISBLANK(Y14),0,V14*Y14/100)","v":0}]
["Equipment Cleaning","Cumberland Products","Advantage 100 Fast Dry Acrylic Lacquer Thinner",100,{"$f":"IF(ISBLANK(B15),\" \",CONCATENATE($A15,\": \",$B15,\" \",$C15,\" \",$D15))","v":"Equipment Cleaning: Cumberland Products Advantage 100 Fast Dry Acrylic Lacquer Thinner 100"},4,"lb/gal",{"$f":"IF($G15 = \"lb/gal\",($F15*120),$F15)","v":480},{"$f":"IF(H15>1,VLOOKUP($A15,'[1]Marine Coating Limits'!$I$3:$L$4,2,FALSE),0)","v":200},{"$f":"IF(H15>0.001,IF($H15>$I15,0,1),0)","v":0},116,{"$f":"IF(K15>0.01,VLOOKUP(A15,'[1]Marine Coating Limits'!$I$3:$L$4,4,FALSE),0)","v":20},{"$f":"IF(K15>0.0001,IF(K15>L15,0,1),0)","v":0},133,"F",{"$f":"IF($O15 = \"F\",CONVERT($N15,\"F\",\"C\"),$N15)","v":56.111111111111107},{"$f":"IF(P15>0.01,VLOOKUP(A15,'[1]Marine Coating Limits'!$I$3:$L$4,3,FALSE),0)","v":190},{"$f":"IF(P15>0.001,IF(P15>Q15,1,0),0)","v":0},{"$f":"IF(ISBLANK(C15),\" \",IF((H15+K15+N15) >0.001,IF((J15+M15+R15)>=1,\"YES\",\"NO\"),\"INCOMPLETE INFORMATION\"))","v":"NO"},{"$f":"IF(ISBLANK(N15),0,IF(S15=\"YES\",0,IF(A15 = \"Equipment Cleaning\",1,0)))","v":1},"Closed Container: equipment or parts are cleaned in a container which is only opened when being accessesed for adding, cleaning, or removing application equipment and parts are allowed to drain or drip prior to removal, as described in 67.18(d)(3)(iii)",null,null,{"$f":"IF(ISBLANK(W15),0,V15*W15/100)","v":0},null,{"$f":"IF(ISBLANK(Y15),0,V15*Y15/100)","v":0}]
["Equipment Cleaning","Dampney Co. Inc.","THINNER","Lab Solvent",{"$f":"IF(ISBLANK(B16),\" \",CONCATENATE($A16,\": \",$B16,\" \",$C16,\" \",$D16))","v":"Equipment Cleaning: Dampney Co. Inc. THINNER Lab Solvent"},7.23,"lb/gal",{"$f":"IF($G16 = \"lb/gal\",($F16*120),$F16)","v":867.6},{"$f":"IF(H16>1,VLOOKUP($A16,'[1]Marine Coating Limits'!$I$3:$L$4,2,FALSE),0)","v":200},{"$f":"IF(H16>0.001,IF($H16>$I16,0,1),0)","v":0},86.087000000000003,{"$f":"IF(K16>0.01,VLOOKUP(A16,'[1]Marine Coating Limits'!$I$3:$L$4,4,FALSE),0)","v":20},{"$f":"IF(K16>0.0001,IF(K16>L16,0,1),0)","v":0},133,"F",{"$f":"IF($O16 = \"F\",CONVERT($N16,\"F\",\"C\"),$N16)","v":56.111111111111107},{"$f":"IF(P16>0.01,VLOOKUP(A16,'[1]Marine Coating Limits'!$I$3:$L$4,3,FALSE),0)","v":190},{"$f":"IF(P16>0.001,IF(P16>Q16,1,0),0)","v":0},{"$f":"IF(ISBLANK(C16),\" \",IF((H16+K16+N16) >0.001,IF((J16+M16+R16)>=1,\"YES\",\"NO\"),\"INCOMPLETE INFORMATION\"))","v":"NO"},{"$f":"IF(ISBLANK(N16),0,IF(S16=\"YES\",0,IF(A16 = \"Equipment Cleaning\",1,0)))","v":1},"Enclosed Parts Cleaning: a system is used that totally encloses the component parts being cleaned during the washing, rinsing, and draining process, as described in 67.18(d)(3)(i)",6.9,null,{"$f":"IF(ISBLANK(W16),0,V16*W16/100)","v":0},null,{"$f":"IF(ISBLANK(Y16),0,V16*Y16/100)","v":0}]
["Equipment Cleaning","International Paint (USA) Inc.","International Thinner","GTA220",{"$f":"IF(ISBLANK(B17),\" \",CONCATENATE($A17,\": \",$B17,\" \",$C17,\" \",$D17))","v":"Equipment Cleaning: International Paint (USA) Inc. International Thinner GTA220"},849,"g/l",{"$f":"IF($G17 = \"lb/gal\",($F17*120),$F17)","v":849},{"$f":"IF(H17>1,VLOOKUP($A17,'[1]Marine Coating Limits'!$I$3:$L$4,2,FALSE),0)","v":200},{"$f":"IF(H17>0.001,IF($H17>$I17,0,1),0)","v":0},6,{"$f":"IF(K17>0.01,VLOOKUP(A17,'[1]Marine Coating Limits'!$I$3:$L$4,4,FALSE),0)","v":20},{"$f":"IF(K17>0.0001,IF(K17>L17,0,1),0)","v":1},243,"F",{"$f":"IF($O17 = \"F\",CONVERT($N17,\"F\",\"C\"),$N17)","v":117.22222222222221},{"$f":"IF(P17>0.01,VLOOKUP(A17,'[1]Marine Coating Limits'!$I$3:$L$4,3,FALSE),0)","v":190},{"$f":"IF(P17>0.001,IF(P17>Q17,1,0),0)","v":0},{"$f":"IF(ISBLANK(C17),\" \",IF((H17+K17+N17) >0.001,IF((J17+M17+R17)>=1,\"YES\",\"NO\"),\"INCOMPLETE INFORMATION\"))","v":"YES"},{"$f":"IF(ISBLANK(N17),0,IF(S17=\"YES\",0,IF(A17 = \"Equipment Cleaning\",1,0)))","v":0},null,7.27,50,{"$f":"IF(ISBLANK(W17),0,V17*W17/100)","v":3.6349999999999998},10,{"$f":"IF(ISBLANK(Y17),0,V17*Y17/100)","v":0.72699999999999987}]
["Equipment Cleaning","ITW American Safety Technologies","S-31 Thinner","S-31",{"$f":"IF(ISBLANK(B18),\" \",CONCATENATE($A18,\": \",$B18,\" \",$C18,\" \",$D18))","v":"Equipment Cleaning: ITW American Safety Technologies S-31 Thinner S-31"},7.25,"lb/gal",{"$f":"IF($G18 = \"lb/gal\",($F18*120),$F18)","v":870},{"$f":"IF(H18>1,VLOOKUP($A18,'[1]Marine Coating Limits'!$I$3:$L$4,2,FALSE),0)","v":200},{"$f":"IF(H18>0.001,IF($H18>$I18,0,1),0)","v":0},8,{"$f":"IF(K18>0.01,VLOOKUP(A18,'[1]Marine Coating Limits'!$I$3:$L$4,4,FALSE),0)","v":20},{"$f":"IF(K18>0.0001,IF(K18>L18,0,1),0)","v":1},280,"F",{"$f":"IF($O18 = \"F\",CONVERT($N18,\"F\",\"C\"),$N18)","v":137.77777777777777},{"$f":"IF(P18>0.01,VLOOKUP(A18,'[1]Marine Coating Limits'!$I$3:$L$4,3,FALSE),0)","v":190},{"$f":"IF(P18>0.001,IF(P18>Q18,1,0),0)","v":0},{"$f":"IF(ISBLANK(C18),\" \",IF((H18+K18+N18) >0.001,IF((J18+M18+R18)>=1,\"YES\",\"NO\"),\"INCOMPLETE INFORMATION\"))","v":"YES"},{"$f":"IF(ISBLANK(N18),0,IF(S18=\"YES\",0,IF(A18 = \"Equipment Cleaning\",1,0)))","v":0},null,null,null,{"$f":"IF(ISBLANK(W18),0,V18*W18/100)","v":0},null,{"$f":"IF(ISBLANK(Y18),0,V18*Y18/100)","v":0}]
["Equipment Cleaning","ITW American Safety Technologies","S-426","MS901E",{"$f":"IF(ISBLANK(B19),\" \",CONCATENATE($A19,\": \",$B19,\" \",$C19,\" \",$D19))","v":"Equipment Cleaning: ITW American Safety Technologies S-426 MS901E"},856,"g/l",{"$f":"IF($G19 = \"lb/gal\",($F19*120),$F19)","v":856},{"$f":"IF(H19>1,VLOOKUP($A19,'[1]Marine Coating Limits'!$I$3:$L$4,2,FALSE),0)","v":200},{"$f":"IF(H19>0.001,IF($H19>$I19,0,1),0)","v":0},8,{"$f":"IF(K19>0.01,VLOOKUP(A19,'[1]Marine Coating Limits'!$I$3:$L$4,4,FALSE),0)","v":20},{"$f":"IF(K19>0.0001,IF(K19>L19,0,1),0)","v":1},246,"F",null,{"$f":"IF(P19>0.01,VLOOKUP(A19,'[1]Marine Coating Limits'!$I$3:$L$4,3,FALSE),0)","v":0},{"$f":"IF(P19>0.001,IF(P19>Q19,1,0),0)","v":0},{"$f":"IF(ISBLANK(C19),\" \",IF((H19+K19+N19) >0.001,IF((J19+M19+R19)>=1,\"YES\",\"NO\"),\"INCOMPLETE INFORMATION\"))","v":"YES"},{"$f":"IF(ISBLANK(N19),0,IF(S19=\"YES\",0,IF(A19 = \"Equipment Cleaning\",1,0)))","v":0},null,null,null,{"$f":"IF(ISBLANK(W19),0,V19*W19/100)","v":0},null,{"$f":"IF(ISBLANK(Y19),0,V19*Y19/100)","v":0}]
["Equipment Cleaning","Master's Touch","SOLVENT DEGREASER-ZERO V.O.C.","MT-34019CS",{"$f":"IF(ISBLANK(B20),\" \",CONCATENATE($A20,\": \",$B20,\" \",$C20,\" \",$D20))","v":"Equipment Cleaning: Master's Touch SOLVENT DEGREASER-ZERO V.O.C. MT-34019CS"},0,"lb/gal",{"$f":"IF($G20 = \"lb/gal\",($F20*120),$F20)","v":0},{"$f":"IF(H20>1,VLOOKUP($A20,'[1]Marine Coating Limits'!$I$3:$L$4,2,FALSE),0)","v":0},{"$f":"IF(H20>0.001,IF($H20>$I20,0,1),0)","v":0},2.6,{"$f":"IF(K20>0.01,VLOOKUP(A20,'[1]Marine Coating Limits'!$I$3:$L$4,4,FALSE),0)","v":20},{"$f":"IF(K20>0.0001,IF(K20>L20,0,1),0)","v":1},250,"F",{"$f":"IF($O20 = \"F\",CONVERT($N20,\"F\",\"C\"),$N20)","v":121.11111111111111},{"$f":"IF(P20>0.01,VLOOKUP(A20,'[1]Marine Coating Limits'!$I$3:$L$4,3,FALSE),0)","v":190},{"$f":"IF(P20>0.001,IF(P20>Q20,1,0),0)","v":0},{"$f":"IF(ISBLANK(C20),\" \",IF((H20+K20+N20) >0.001,IF((J20+M20+R20)>=1,\"YES\",\"NO\"),\"INCOMPLETE INFORMATION\"))","v":"YES"},{"$f":"IF(ISBLANK(N20),0,IF(S20=\"YES\",0,IF(A20 = \"Equipment Cleaning\",1,0)))","v":0},null,null,null,{"$f":"IF(ISBLANK(W20),0,V20*W20/100)","v":0},null,{"$f":"IF(ISBLANK(Y20),0,V20*Y20/100)","v":0}]
["Equipment Cleaning","PPG","T-10 THINNER 010T0000","ATT10/04",{"$f":"IF(ISBLANK(B21),\" \",CONCATENATE($A21,\": \",$B21,\" \",$C21,\" \",$D21))","v":"Equipment Cleaning: PPG T-10 THINNER 010T0000 ATT10/04"},836,"g/l",{"$f":"IF($G21 = \"lb/gal\",($F21*120),$F21)","v":836},{"$f":"IF(H21>1,VLOOKUP($A21,'[1]Marine Coating Limits'!$I$3:$L$4,2,FALSE),0)","v":200},{"$f":"IF(H21>0.001,IF($H21>$I21,0,1),0)","v":0},4.2,{"$f":"IF(K21>0.01,VLOOKUP(A21,'[1]Marine Coating Limits'!$I$3:$L$4,4,FALSE),0)","v":20},{"$f":"IF(K21>0.0001,IF(K21>L21,0,1),0)","v":1},100,"F",{"$f":"IF($O21 = \"F\",CONVERT($N21,\"F\",\"C\"),$N21)","v":37.777777777777779},{"$f":"IF(P21>0.01,VLOOKUP(A21,'[1]Marine Coating Limits'!$I$3:$L$4,3,FALSE),0)","v":190},{"$f":"IF(P21>0.001,IF(P21>Q21,1,0),0)","v":0},{"$f":"IF(ISBLANK(C21),\" \",IF((H21+K21+N21) >0.001,IF((J21+M21+R21)>=1,\"YES\",\"NO\"),\"INCOMPLETE INFORMATION\"))","v":"YES"},{"$f":"IF(ISBLANK(N21),0,IF(S21=\"YES\",0,IF(A21 = \"Equipment Cleaning\",1,0)))","v":0},null,6.93,40,{"$f":"IF(ISBLANK(W21),0,V21*W21/100)","v":2.7719999999999998},40,{"$f":"IF(ISBLANK(Y21),0,V21*Y21/100)","v":2.7719999999999998}]
["Equipment Cleaning","Sherwin Williams (Proline Paints)","Lacquer Thinner","R7K115",{"$f":"IF(ISBLANK(B22),\" \",CONCATENATE($A22,\": \",$B22,\" \",$C22,\" \",$D22))","v":"Equipment Cleaning: Sherwin Williams (Proline Paints) Lacquer Thinner R7K115"},827,"g/l",{"$f":"IF($G22 = \"lb/gal\",($F22*120),$F22)","v":827},{"$f":"IF(H22>1,VLOOKUP($A22,'[1]Marine Coating Limits'!$I$3:$L$4,2,FALSE),0)","v":200},{"$f":"IF(H22>0.001,IF($H22>$I22,0,1),0)","v":0},294,{"$f":"IF(K22>0.01,VLOOKUP(A22,'[1]Marine Coating Limits'!$I$3:$L$4,4,FALSE),0)","v":20},{"$f":"IF(K22>0.0001,IF(K22>L22,0,1),0)","v":0},132,"F",{"$f":"IF($O22 = \"F\",CONVERT($N22,\"F\",\"C\"),$N22)","v":55.555555555555557},{"$f":"IF(P22>0.01,VLOOKUP(A22,'[1]Marine Coating Limits'!$I$3:$L$4,3,FALSE),0)","v":190},{"$f":"IF(P22>0.001,IF(P22>Q22,1,0),0)","v":0},{"$f":"IF(ISBLANK(C22),\" \",IF((H22+K22+N22) >0.001,IF((J22+M22+R22)>=1,\"YES\",\"NO\"),\"INCOMPLETE INFORMATION\"))","v":"NO"},{"$f":"IF(ISBLANK(N22),0,IF(S22=\"YES\",0,IF(A22 = \"Equipment Cleaning\",1,0)))","v":1},"Contained Flushing: cleaning solvent is flushed or rinsed through equipment in a contained manner as described in 67.18(d)(3)(ii)",null,null,{"$f":"IF(ISBLANK(W22),0,V22*W22/100)","v":0},null,{"$f":"IF(ISBLANK(Y22),0,V22*Y22/100)","v":0}]
["Equipment Cleaning","Sherwin Williams (Proline Paints)","Methyl Amyl Ketone","R6K30",{"$f":"IF(ISBLANK(B23),\" \",CONCATENATE($A23,\": \",$B23,\" \",$C23,\" \",$D23))","v":"Equipment Cleaning: Sherwin Williams (Proline Paints) Methyl Amyl Ketone R6K30"},810,"g/l",{"$f":"IF($G23 = \"lb/gal\",($F23*120),$F23)","v":810},{"$f":"IF(H23>1,VLOOKUP($A23,'[1]Marine Coating Limits'!$I$3:$L$4,2,FALSE),0)","v":200},{"$f":"IF(H23>0.001,IF($H23>$I23,0,1),0)","v":0},3.855,{"$f":"IF(K23>0.01,VLOOKUP(A23,'[1]Marine Coating Limits'!$I$3:$L$4,4,FALSE),0)","v":20},{"$f":"IF(K23>0.0001,IF(K23>L23,0,1),0)","v":1},297,"F",{"$f":"IF($O23 = \"F\",CONVERT($N23,\"F\",\"C\"),$N23)","v":147.22222222222223},{"$f":"IF(P23>0.01,VLOOKUP(A23,'[1]Marine Coating Limits'!$I$3:$L$4,3,FALSE),0)","v":190},{"$f":"IF(P23>0.001,IF(P23>Q23,1,0),0)","v":0},{"$f":"IF(ISBLANK(C23),\" \",IF((H23+K23+N23) >0.001,IF((J23+M23+R23)>=1,\"YES\",\"NO\"),\"INCOMPLETE INFORMATION\"))","v":"YES"},{"$f":"IF(ISBLANK(N23),0,IF(S23=\"YES\",0,IF(A23 = \"Equipment Cleaning\",1,0)))","v":0},null,null,null,{"$f":"IF(ISBLANK(W23),0,V23*W23/100)","v":0},null,{"$f":"IF(ISBLANK(Y23),0,V23*Y23/100)","v":0}]
["Equipment Cleaning","Sherwin Williams (Proline Paints)","No. 27 E Thinner Paint Thinner",27,{"$f":"IF(ISBLANK(B24),\" \",CONCATENATE($A24,\": \",$B24,\" \",$C24,\" \",$D24))","v":"Equipment Cleaning: Sherwin Williams (Proline Paints) No. 27 E Thinner Paint Thinner 27"},769,"g/l",{"$f":"IF($G24 = \"lb/gal\",($F24*120),$F24)","v":769},{"$f":"IF(H24>1,VLOOKUP($A24,'[1]Marine Coating Limits'!$I$3:$L$4,2,FALSE),0)","v":200},{"$f":"IF(H24>0.001,IF($H24>$I24,0,1),0)","v":0},2,{"$f":"IF(K24>0.01,VLOOKUP(A24,'[1]Marine Coating Limits'!$I$3:$L$4,4,FALSE),0)","v":20},{"$f":"IF(K24>0.0001,IF(K24>L24,0,1),0)","v":1},300,"F",{"$f":"IF($O24 = \"F\",CONVERT($N24,\"F\",\"C\"),$N24)","v":148.88888888888889},{"$f":"IF(P24>0.01,VLOOKUP(A24,'[1]Marine Coating Limits'!$I$3:$L$4,3,FALSE),0)","v":190},{"$f":"IF(P24>0.001,IF(P24>Q24,1,0),0)","v":0},{"$f":"IF(ISBLANK(C24),\" \",IF((H24+K24+N24) >0.001,IF((J24+M24+R24)>=1,\"YES\",\"NO\"),\"INCOMPLETE INFORMATION\"))","v":"YES"},{"$f":"IF(ISBLANK(N24),0,IF(S24=\"YES\",0,IF(A24 = \"Equipment Cleaning\",1,0)))","v":0},null,null,null,{"$f":"IF(ISBLANK(W24),0,V24*W24/100)","v":0},null,{"$f":"IF(ISBLANK(Y24),0,V24*Y24/100)","v":0}]
["Equipment Cleaning","Sherwin Williams (Proline Paints)","NO. 8 Thinner Expoxy Reducer",8,{"$f":"IF(ISBLANK(B25),\" \",CONCATENATE($A25,\": \",$B25,\" \",$C25,\" \",$D25))","v":"Equipment Cleaning: Sherwin Williams (Proline Paints) NO. 8 Thinner Expoxy Reducer 8"},838,"g/l",{"$f":"IF($G25 = \"lb/gal\",($F25*120),$F25)","v":838},{"$f":"IF(H25>1,VLOOKUP($A25,'[1]Marine Coating Limits'!$I$3:$L$4,2,FALSE),0)","v":200},{"$f":"IF(H25>0.001,IF($H25>$I25,0,1),0)","v":0},4.5,{"$f":"IF(K25>0.01,VLOOKUP(A25,'[1]Marine Coating Limits'!$I$3:$L$4,4,FALSE),0)","v":20},{"$f":"IF(K25>0.0001,IF(K25>L25,0,1),0)","v":1},243,"F",{"$f":"IF($O25 = \"F\",CONVERT($N25,\"F\",\"C\"),$N25)","v":117.22222222222221},{"$f":"IF(P25>0.01,VLOOKUP(A25,'[1]Marine Coating Limits'!$I$3:$L$4,3,FALSE),0)","v":190},{"$f":"IF(P25>0.001,IF(P25>Q25,1,0),0)","v":0},{"$f":"IF(ISBLANK(C25),\" \",IF((H25+K25+N25) >0.001,IF((J25+M25+R25)>=1,\"YES\",\"NO\"),\"INCOMPLETE INFORMATION\"))","v":"YES"},{"$f":"IF(ISBLANK(N25),0,IF(S25=\"YES\",0,IF(A25 = \"Equipment Cleaning\",1,0)))","v":0},null,7,46,{"$f":"IF(ISBLANK(W25),0,V25*W25/100)","v":3.22},2,{"$f":"IF(ISBLANK(Y25),0,V25*Y25/100)","v":0.14000000000000001}]
["Equipment Cleaning","Sunshine Makers, Inc.","Simple Green",13012,{"$f":"IF(ISBLANK(B26),\" \",CONCATENATE($A26,\": \",$B26,\" \",$C26,\" \",$D26))","v":"Equipment Cleaning: Sunshine Makers, Inc. Simple Green 13012"},28,"g/l",{"$f":"IF($G26 = \"lb/gal\",($F26*120),$F26)","v":28},{"$f":"IF(H26>1,VLOOKUP($A26,'[1]Marine Coating Limits'!$I$3:$L$4,2,FALSE),0)","v":200},{"$f":"IF(H26>0.001,IF($H26>$I26,0,1),0)","v":1},18,{"$f":"IF(K26>0.01,VLOOKUP(A26,'[1]Marine Coating Limits'!$I$3:$L$4,4,FALSE),0)","v":20},{"$f":"IF(K26>0.0001,IF(K26>L26,0,1),0)","v":1},210,"F",{"$f":"IF($O26 = \"F\",CONVERT($N26,\"F\",\"C\"),$N26)","v":98.888888888888886},{"$f":"IF(P26>0.01,VLOOKUP(A26,'[1]Marine Coating Limits'!$I$3:$L$4,3,FALSE),0)","v":190},{"$f":"IF(P26>0.001,IF(P26>Q26,1,0),0)","v":0},{"$f":"IF(ISBLANK(C26),\" \",IF((H26+K26+N26) >0.001,IF((J26+M26+R26)>=1,\"YES\",\"NO\"),\"INCOMPLETE INFORMATION\"))","v":"YES"},{"$f":"IF(ISBLANK(N26),0,IF(S26=\"YES\",0,IF(A26 = \"Equipment Cleaning\",1,0)))","v":0},null,null,null,{"$f":"IF(ISBLANK(W26),0,V26*W26/100)","v":0},null,{"$f":"IF(ISBLANK(Y26),0,V26*Y26/100)","v":0}]
["Surface Preparation","BIO-TEK SOLVENTS, INC.","#134 HI-SOLV",null,{"$f":"IF(ISBLANK(B27),\" \",CONCATENATE($A27,\": \",$B27,\" \",$C27,\" \",$D27))","v":"Surface Preparation: BIO-TEK SOLVENTS, INC. #134 HI-SOLV "},787,"g/l",{"$f":"IF($G27 = \"lb/gal\",($F27*120),$F27)","v":787},{"$f":"IF(H27>1,VLOOKUP($A27,'[1]Marine Coating Limits'!$I$3:$L$4,2,FALSE),0)","v":200},{"$f":"IF(H27>0.001,IF($H27>$I27,0,1),0)","v":0},0.1,{"$f":"IF(K27>0.01,VLOOKUP(A27,'[1]Marine Coating Limits'!$I$3:$L$4,4,FALSE),0)","v":45},{"$f":"IF(K27>0.0001,IF(K27>L27,0,1),0)","v":1},430,"F",{"$f":"IF($O27 = \"F\",CONVERT($N27,\"F\",\"C\"),$N27)","v":221.11111111111111},{"$f":"IF(P27>0.01,VLOOKUP(A27,'[1]Marine Coating Limits'!$I$3:$L$4,3,FALSE),0)","v":190},{"$f":"IF(P27>0.001,IF(P27>Q27,1,0),0)","v":1},{"$f":"IF(ISBLANK(C27),\" \",IF((H27+K27+N27) >0.001,IF((J27+M27+R27)>=1,\"YES\",\"NO\"),\"INCOMPLETE INFORMATION\"))","v":"YES"},{"$f":"IF(ISBLANK(N27),0,IF(S27=\"YES\",0,IF(A27 = \"Equipment Cleaning\",1,0)))","v":0},null,null,null,{"$f":"IF(ISBLANK(W27),0,V27*W27/100)","v":0},null,{"$f":"IF(ISBLANK(Y27),0,V27*Y27/100)","v":0}]
["Surface Preparation","Brenntag Pacific","40/60 MEK/MIBK Wipe Solvent",628893,{"$f":"IF(ISBLANK(B28),\" \",CONCATENATE($A28,\": \",$B28,\" \",$C28,\" \",$D28))","v":"Surface Preparation: Brenntag Pacific 40/60 MEK/MIBK Wipe Solvent 628893"},802,"g/l",{"$f":"IF($G28 = \"lb/gal\",($F28*120),$F28)","v":802},{"$f":"IF(H28>1,VLOOKUP($A28,'[1]Marine Coating Limits'!$I$3:$L$4,2,FALSE),0)","v":200},{"$f":"IF(H28>0.001,IF($H28>$I28,0,1),0)","v":0},41.9,{"$f":"IF(K28>0.01,VLOOKUP(A28,'[1]Marine Coating Limits'!$I$3:$L$4,4,FALSE),0)","v":45},{"$f":"IF(K28>0.0001,IF(K28>L28,0,1),0)","v":1},174,"F",{"$f":"IF($O28 = \"F\",CONVERT($N28,\"F\",\"C\"),$N28)","v":78.888888888888886},{"$f":"IF(P28>0.01,VLOOKUP(A28,'[1]Marine Coating Limits'!$I$3:$L$4,3,FALSE),0)","v":190},{"$f":"IF(P28>0.001,IF(P28>Q28,1,0),0)","v":0},{"$f":"IF(ISBLANK(C28),\" \",IF((H28+K28+N28) >0.001,IF((J28+M28+R28)>=1,\"YES\",\"NO\"),\"INCOMPLETE INFORMATION\"))","v":"YES"},{"$f":"IF(ISBLANK(N28),0,IF(S28=\"YES\",0,IF(A28 = \"Equipment Cleaning\",1,0)))","v":0},null,null,null,{"$f":"IF(ISBLANK(W28),0,V28*W28/100)","v":0},null,{"$f":"IF(ISBLANK(Y28),0,V28*Y28/100)","v":0}]
["Surface Preparation","Brenntag Pacific","INTERN'L THINNER","GT 4637",{"$f":"IF(ISBLANK(B29),\" \",CONCATENATE($A29,\": \",$B29,\" \",$C29,\" \",$D29))","v":"Surface Preparation: Brenntag Pacific INTERN'L THINNER GT 4637"},7.23,"lb/gal",{"$f":"IF($G29 = \"lb/gal\",($F29*120),$F29)","v":867.6},{"$f":"IF(H29>1,VLOOKUP($A29,'[1]Marine Coating Limits'!$I$3:$L$4,2,FALSE),0)","v":200},{"$f":"IF(H29>0.001,IF($H29>$I29,0,1),0)","v":0},5.6,{"$f":"IF(K29>0.01,VLOOKUP(A29,'[1]Marine Coating Limits'!$I$3:$L$4,4,FALSE),0)","v":45},{"$f":"IF(K29>0.0001,IF(K29>L29,0,1),0)","v":1},330,"F",{"$f":"IF($O29 = \"F\",CONVERT($N29,\"F\",\"C\"),$N29)","v":165.55555555555554},{"$f":"IF(P29>0.01,VLOOKUP(A29,'[1]Marine Coating Limits'!$I$3:$L$4,3,FALSE),0)","v":190},{"$f":"IF(P29>0.001,IF(P29>Q29,1,0),0)","v":0},{"$f":"IF(ISBLANK(C29),\" \",IF((H29+K29+N29) >0.001,IF((J29+M29+R29)>=1,\"YES\",\"NO\"),\"INCOMPLETE INFORMATION\"))","v":"YES"},{"$f":"IF(ISBLANK(N29),0,IF(S29=\"YES\",0,IF(A29 = \"Equipment Cleaning\",1,0)))","v":0},null,null,null,{"$f":"IF(ISBLANK(W29),0,V29*W29/100)","v":0},null,{"$f":"IF(ISBLANK(Y29),0,V29*Y29/100)","v":0}]
["Surface Preparation","Brenntag Pacific","Lacquer Wash","201-X",{"$f":"IF(ISBLANK(B30),\" \",CONCATENATE($A30,\": \",$B30,\" \",$C30,\" \",$D30))","v":"Surface Preparation: Brenntag Pacific Lacquer Wash 201-X"},622,"g/l",{"$f":"IF($G30 = \"lb/gal\",($F30*120),$F30)","v":622},{"$f":"IF(H30>1,VLOOKUP($A30,'[1]Marine Coating Limits'!$I$3:$L$4,2,FALSE),0)","v":200},{"$f":"IF(H30>0.001,IF($H30>$I30,0,1),0)","v":0},37.200000000000003,{"$f":"IF(K30>0.01,VLOOKUP(A30,'[1]Marine Coating Limits'!$I$3:$L$4,4,FALSE),0)","v":45},{"$f":"IF(K30>0.0001,IF(K30>L30,0,1),0)","v":1},133,"F",{"$f":"IF($O30 = \"F\",CONVERT($N30,\"F\",\"C\"),$N30)","v":56.111111111111107},{"$f":"IF(P30>0.01,VLOOKUP(A30,'[1]Marine Coating Limits'!$I$3:$L$4,3,FALSE),0)","v":190},{"$f":"IF(P30>0.001,IF(P30>Q30,1,0),0)","v":0},{"$f":"IF(ISBLANK(C30),\" \",IF((H30+K30+N30) >0.001,IF((J30+M30+R30)>=1,\"YES\",\"NO\"),\"INCOMPLETE INFORMATION\"))","v":"YES"},{"$f":"IF(ISBLANK(N30),0,IF(S30=\"YES\",0,IF(A30 = \"Equipment Cleaning\",1,0)))","v":0},null,null,null,{"$f":"IF(ISBLANK(W30),0,V30*W30/100)","v":0},null,{"$f":"IF(ISBLANK(Y30),0,V30*Y30/100)","v":0}]
["Surface Preparation","Ellis Paint Co.","ZERO VOC EXEMPT SOLVENT","80/20",{"$f":"IF(ISBLANK(B31),\" \",CONCATENATE($A31,\": \",$B31,\" \",$C31,\" \",$D31))","v":"Surface Preparation: Ellis Paint Co. ZERO VOC EXEMPT SOLVENT 80/20"},0,"g/l",{"$f":"IF($G31 = \"lb/gal\",($F31*120),$F31)","v":0},{"$f":"IF(H31>1,VLOOKUP($A31,'[1]Marine Coating Limits'!$I$3:$L$4,2,FALSE),0)","v":0},{"$f":"IF(H31>0.001,IF($H31>$I31,0,1),0)","v":0},null,{"$f":"IF(K31>0.01,VLOOKUP(A31,'[1]Marine Coating Limits'!$I$3:$L$4,4,FALSE),0)","v":0},{"$f":"IF(K31>0.0001,IF(K31>L31,0,1),0)","v":0},132.80000000000001,"F",{"$f":"IF($O31 = \"F\",CONVERT($N31,\"F\",\"C\"),$N31)","v":56.000000000000007},{"$f":"IF(P31>0.01,VLOOKUP(A31,'[1]Marine Coating Limits'!$I$3:$L$4,3,FALSE),0)","v":190},{"$f":"IF(P31>0.001,IF(P31>Q31,1,0),0)","v":0},"Exempt",{"$f":"IF(ISBLANK(N31),0,IF(S31=\"YES\",0,IF(A31 = \"Equipment Cleaning\",1,0)))","v":0},null,null,null,{"$f":"IF(ISBLANK(W31),0,V31*W31/100)","v":0},null,{"$f":"IF(ISBLANK(Y31),0,V31*Y31/100)","v":0}]
["Surface Preparation","GENERIC","Isopropyl Alcohol",null,{"$f":"IF(ISBLANK(B32),\" \",CONCATENATE($A32,\": \",$B32,\" \",$C32,\" \",$D32))","v":"Surface Preparation: GENERIC Isopropyl Alcohol "},787,"g/l",{"$f":"IF($G32 = \"lb/gal\",($F32*120),$F32)","v":787},{"$f":"IF(H32>1,VLOOKUP($A32,'[1]Marine Coating Limits'!$I$3:$L$4,2,FALSE),0)","v":200},{"$f":"IF(H32>0.001,IF($H32>$I32,0,1),0)","v":0},31.2,{"$f":"IF(K32>0.01,VLOOKUP(A32,'[1]Marine Coating Limits'!$I$3:$L$4,4,FALSE),0)","v":45},{"$f":"IF(K32>0.0001,IF(K32>L32,0,1),0)","v":1},108,"F",{"$f":"IF($O32 = \"F\",CONVERT($N32,\"F\",\"C\"),$N32)","v":42.222222222222221},{"$f":"IF(P32>0.01,VLOOKUP(A32,'[1]Marine Coating Limits'!$I$3:$L$4,3,FALSE),0)","v":190},{"$f":"IF(P32>0.001,IF(P32>Q32,1,0),0)","v":0},{"$f":"IF(ISBLANK(C32),\" \",IF((H32+K32+N32) >0.001,IF((J32+M32+R32)>=1,\"YES\",\"NO\"),\"INCOMPLETE INFORMATION\"))","v":"YES"},{"$f":"IF(ISBLANK(N32),0,IF(S32=\"YES\",0,IF(A32 = \"Equipment Cleaning\",1,0)))","v":0},null,null,null,{"$f":"IF(ISBLANK(W32),0,V32*W32/100)","v":0},null,{"$f":"IF(ISBLANK(Y32),0,V32*Y32/100)","v":0}]
["Surface Preparation","International Paint (USA) Inc.","International Thinner","GTA220",{"$f":"IF(ISBLANK(B33),\" \",CONCATENATE($A33,\": \",$B33,\" \",$C33,\" \",$D33))","v":"Surface Preparation: International Paint (USA) Inc. International Thinner GTA220"},849,"g/l",{"$f":"IF($G33 = \"lb/gal\",($F33*120),$F33)","v":849},{"$f":"IF(H33>1,VLOOKUP($A33,'[1]Marine Coating Limits'!$I$3:$L$4,2,FALSE),0)","v":200},{"$f":"IF(H33>0.001,IF($H33>$I33,0,1),0)","v":0},6,{"$f":"IF(K33>0.01,VLOOKUP(A33,'[1]Marine Coating Limits'!$I$3:$L$4,4,FALSE),0)","v":45},{"$f":"IF(K33>0.0001,IF(K33>L33,0,1),0)","v":1},243,"F",{"$f":"IF($O33 = \"F\",CONVERT($N33,\"F\",\"C\"),$N33)","v":117.22222222222221},{"$f":"IF(P33>0.01,VLOOKUP(A33,'[1]Marine Coating Limits'!$I$3:$L$4,3,FALSE),0)","v":190},{"$f":"IF(P33>0.001,IF(P33>Q33,1,0),0)","v":0},{"$f":"IF(ISBLANK(C33),\" \",IF((H33+K33+N33) >0.001,IF((J33+M33+R33)>=1,\"YES\",\"NO\"),\"INCOMPLETE INFORMATION\"))","v":"YES"},{"$f":"IF(ISBLANK(N33),0,IF(S33=\"YES\",0,IF(A33 = \"Equipment Cleaning\",1,0)))","v":0},null,7.27,50,{"$f":"IF(ISBLANK(W33),0,V33*W33/100)","v":3.6349999999999998},10,{"$f":"IF(ISBLANK(Y33),0,V33*Y33/100)","v":0.72699999999999987}]
["Surface Preparation","ITW American Safety Technologies","S-31 Thinner","S-31",{"$f":"IF(ISBLANK(B34),\" \",CONCATENATE($A34,\": \",$B34,\" \",$C34,\" \",$D34))","v":"Surface Preparation: ITW American Safety Technologies S-31 Thinner S-31"},7.25,"lb/gal",{"$f":"IF($G34 = \"lb/gal\",($F34*120),$F34)","v":870},{"$f":"IF(H34>1,VLOOKUP($A34,'[1]Marine Coating Limits'!$I$3:$L$4,2,FALSE),0)","v":200},{"$f":"IF(H34>0.001,IF($H34>$I34,0,1),0)","v":0},8,{"$f":"IF(K34>0.01,VLOOKUP(A34,'[1]Marine Coating Limits'!$I$3:$L$4,4,FALSE),0)","v":45},{"$f":"IF(K34>0.0001,IF(K34>L34,0,1),0)","v":1},280,"F",{"$f":"IF($O34 = \"F\",CONVERT($N34,\"F\",\"C\"),$N34)","v":137.77777777777777},{"$f":"IF(P34>0.01,VLOOKUP(A34,'[1]Marine Coating Limits'!$I$3:$L$4,3,FALSE),0)","v":190},{"$f":"IF(P34>0.001,IF(P34>Q34,1,0),0)","v":0},{"$f":"IF(ISBLANK(C34),\" \",IF((H34+K34+N34) >0.001,IF((J34+M34+R34)>=1,\"YES\",\"NO\"),\"INCOMPLETE INFORMATION\"))","v":"YES"},{"$f":"IF(ISBLANK(N34),0,IF(S34=\"YES\",0,IF(A34 = \"Equipment Cleaning\",1,0)))","v":0},null,null,null,{"$f":"IF(ISBLANK(W34),0,V34*W34/100)","v":0},null,{"$f":"IF(ISBLANK(Y34),0,V34*Y34/100)","v":0}]
["Surface Preparation","ITW American Safety Technologies","S-426","MS901E",{"$f":"IF(ISBLANK(B35),\" \",CONCATENATE($A35,\": \",$B35,\" \",$C35,\" \",$D35))","v":"Surface Preparation: ITW American Safety Technologies S-426 MS901E"},856,"g/l",{"$f":"IF($G35 = \"lb/gal\",($F35*120),$F35)","v":856},{"$f":"IF(H35>1,VLOOKUP($A35,'[1]Marine Coating Limits'!$I$3:$L$4,2,FALSE),0)","v":200},{"$f":"IF(H35>0.001,IF($H35>$I35,0,1),0)","v":0},8,{"$f":"IF(K35>0.01,VLOOKUP(A35,'[1]Marine Coating Limits'!$I$3:$L$4,4,FALSE),0)","v":45},{"$f":"IF(K35>0.0001,IF(K35>L35,0,1),0)","v":1},246,"F",{"$f":"IF($O35 = \"F\",CONVERT($N35,\"F\",\"C\"),$N35)","v":118.88888888888889},{"$f":"IF(P35>0.01,VLOOKUP(A35,'[1]Marine Coating Limits'!$I$3:$L$4,3,FALSE),0)","v":190},{"$f":"IF(P35>0.001,IF(P35>Q35,1,0),0)","v":0},{"$f":"IF(ISBLANK(C35),\" \",IF((H35+K35+N35) >0.001,IF((J35+M35+R35)>=1,\"YES\",\"NO\"),\"INCOMPLETE INFORMATION\"))","v":"YES"},{"$f":"IF(ISBLANK(N35),0,IF(S35=\"YES\",0,IF(A35 = \"Equipment Cleaning\",1,0)))","v":0},null,null,null,{"$f":"IF(ISBLANK(W35),0,V35*W35/100)","v":0},null,{"$f":"IF(ISBLANK(Y35),0,V35*Y35/100)","v":0}]
["Surface Preparation","Master's Touch","SOLVENT DEGREASER-ZERO V.O.C.","MT-34019CS",{"$f":"IF(ISBLANK(B36),\" \",CONCATENATE($A36,\": \",$B36,\" \",$C36,\" \",$D36))","v":"Surface Preparation: Master's Touch SOLVENT DEGREASER-ZERO V.O.C. MT-34019CS"},0,"lb/gal",{"$f":"IF($G36 = \"lb/gal\",($F36*120),$F36)","v":0},{"$f":"IF(H36>1,VLOOKUP($A36,'[1]Marine Coating Limits'!$I$3:$L$4,2,FALSE),0)","v":0},{"$f":"IF(H36>0.001,IF($H36>$I36,0,1),0)","v":0},2.6,{"$f":"IF(K36>0.01,VLOOKUP(A36,'[1]Marine Coating Limits'!$I$3:$L$4,4,FALSE),0)","v":45},{"$f":"IF(K36>0.0001,IF(K36>L36,0,1),0)","v":1},250,"F",{"$f":"IF($O36 = \"F\",CONVERT($N36,\"F\",\"C\"),$N36)","v":121.11111111111111},{"$f":"IF(P36>0.01,VLOOKUP(A36,'[1]Marine Coating Limits'!$I$3:$L$4,3,FALSE),0)","v":190},{"$f":"IF(P36>0.001,IF(P36>Q36,1,0),0)","v":0},{"$f":"IF(ISBLANK(C36),\" \",IF((H36+K36+N36) >0.001,IF((J36+M36+R36)>=1,\"YES\",\"NO\"),\"INCOMPLETE INFORMATION\"))","v":"YES"},{"$f":"IF(ISBLANK(N36),0,IF(S36=\"YES\",0,IF(A36 = \"Equipment Cleaning\",1,0)))","v":0},null,null,null,{"$f":"IF(ISBLANK(W36),0,V36*W36/100)","v":0},null,{"$f":"IF(ISBLANK(Y36),0,V36*Y36/100)","v":0}]
["Surface Preparation","PPG","T-10 THINNER 010T0000","ATT10/04",{"$f":"IF(ISBLANK(B37),\" \",CONCATENATE($A37,\": \",$B37,\" \",$C37,\" \",$D37))","v":"Surface Preparation: PPG T-10 THINNER 010T0000 ATT10/04"},836,"g/l",{"$f":"IF($G37 = \"lb/gal\",($F37*120),$F37)","v":836},{"$f":"IF(H37>1,VLOOKUP($A37,'[1]Marine Coating Limits'!$I$3:$L$4,2,FALSE),0)","v":200},{"$f":"IF(H37>0.001,IF($H37>$I37,0,1),0)","v":0},4.2,{"$f":"IF(K37>0.01,VLOOKUP(A37,'[1]Marine Coating Limits'!$I$3:$L$4,4,FALSE),0)","v":45},{"$f":"IF(K37>0.0001,IF(K37>L37,0,1),0)","v":1},100,"F",{"$f":"IF($O37 = \"F\",CONVERT($N37,\"F\",\"C\"),$N37)","v":37.777777777777779},{"$f":"IF(P37>0.01,VLOOKUP(A37,'[1]Marine Coating Limits'!$I$3:$L$4,3,FALSE),0)","v":190},{"$f":"IF(P37>0.001,IF(P37>Q37,1,0),0)","v":0},{"$f":"IF(ISBLANK(C37),\" \",IF((H37+K37+N37) >0.001,IF((J37+M37+R37)>=1,\"YES\",\"NO\"),\"INCOMPLETE INFORMATION\"))","v":"YES"},{"$f":"IF(ISBLANK(N37),0,IF(S37=\"YES\",0,IF(A37 = \"Equipment Cleaning\",1,0)))","v":0},null,6.93,40,{"$f":"IF(ISBLANK(W37),0,V37*W37/100)","v":2.7719999999999998},40,{"$f":"IF(ISBLANK(Y37),0,V37*Y37/100)","v":2.7719999999999998}]
["Surface Preparation","Sherwin Williams (Proline Paints)","Acetone","ACETONE/SW",{"$f":"IF(ISBLANK(B38),\" \",CONCATENATE($A38,\": \",$B38,\" \",$C38,\" \",$D38))","v":"Surface Preparation: Sherwin Williams (Proline Paints) Acetone ACETONE/SW"},0,"g/l",{"$f":"IF($G38 = \"lb/gal\",($F38*120),$F38)","v":0},{"$f":"IF(H38>1,VLOOKUP($A38,'[1]Marine Coating Limits'!$I$3:$L$4,2,FALSE),0)","v":0},{"$f":"IF(H38>0.001,IF($H38>$I38,0,1),0)","v":0},null,{"$f":"IF(K38>0.01,VLOOKUP(A38,'[1]Marine Coating Limits'!$I$3:$L$4,4,FALSE),0)","v":0},{"$f":"IF(K38>0.0001,IF(K38>L38,0,1),0)","v":0},132,"F",{"$f":"IF($O38 = \"F\",CONVERT($N38,\"F\",\"C\"),$N38)","v":55.555555555555557},{"$f":"IF(P38>0.01,VLOOKUP(A38,'[1]Marine Coating Limits'!$I$3:$L$4,3,FALSE),0)","v":190},{"$f":"IF(P38>0.001,IF(P38>Q38,1,0),0)","v":0},"Exempt",{"$f":"IF(ISBLANK(N38),0,IF(S38=\"YES\",0,IF(A38 = \"Equipment Cleaning\",1,0)))","v":0},null,null,null,{"$f":"IF(ISBLANK(W38),0,V38*W38/100)","v":0},null,{"$f":"IF(ISBLANK(Y38),0,V38*Y38/100)","v":0}]
["Surface Preparation","Sherwin Williams (Proline Paints)","Acetone","R6K9",{"$f":"IF(ISBLANK(B39),\" \",CONCATENATE($A39,\": \",$B39,\" \",$C39,\" \",$D39))","v":"Surface Preparation: Sherwin Williams (Proline Paints) Acetone R6K9"},null,null,{"$f":"IF($G39 = \"lb/gal\",($F39*120),$F39)","v":0},{"$f":"IF(H39>1,VLOOKUP($A39,'[1]Marine Coating Limits'!$I$3:$L$4,2,FALSE),0)","v":0},{"$f":"IF(H39>0.001,IF($H39>$I39,0,1),0)","v":0},null,{"$f":"IF(K39>0.01,VLOOKUP(A39,'[1]Marine Coating Limits'!$I$3:$L$4,4,FALSE),0)","v":0},{"$f":"IF(K39>0.0001,IF(K39>L39,0,1),0)","v":0},132,"F",{"$f":"IF($O39 = \"F\",CONVERT($N39,\"F\",\"C\"),$N39)","v":55.555555555555557},{"$f":"IF(P39>0.01,VLOOKUP(A39,'[1]Marine Coating Limits'!$I$3:$L$4,3,FALSE),0)","v":190},{"$f":"IF(P39>0.001,IF(P39>Q39,1,0),0)","v":0},"Exempt",{"$f":"IF(ISBLANK(N39),0,IF(S39=\"YES\",0,IF(A39 = \"Equipment Cleaning\",1,0)))","v":0},null,null,null,{"$f":"IF(ISBLANK(W39),0,V39*W39/100)","v":0},null,{"$f":"IF(ISBLANK(Y39),0,V39*Y39/100)","v":0}]
["Surface Preparation","Sherwin Williams (Proline Paints)","All Purpose Cleaner Degreaser",747,{"$f":"IF(ISBLANK(B40),\" \",CONCATENATE($A40,\": \",$B40,\" \",$C40,\" \",$D40))","v":"Surface Preparation: Sherwin Williams (Proline Paints) All Purpose Cleaner Degreaser 747"},0,"lb/gal",{"$f":"IF($G40 = \"lb/gal\",($F40*120),$F40)","v":0},{"$f":"IF(H40>1,VLOOKUP($A40,'[1]Marine Coating Limits'!$I$3:$L$4,2,FALSE),0)","v":0},{"$f":"IF(H40>0.001,IF($H40>$I40,0,1),0)","v":0},30.99,{"$f":"IF(K40>0.01,VLOOKUP(A40,'[1]Marine Coating Limits'!$I$3:$L$4,4,FALSE),0)","v":45},{"$f":"IF(K40>0.0001,IF(K40>L40,0,1),0)","v":1},212,"F",{"$f":"IF($O40 = \"F\",CONVERT($N40,\"F\",\"C\"),$N40)","v":100},{"$f":"IF(P40>0.01,VLOOKUP(A40,'[1]Marine Coating Limits'!$I$3:$L$4,3,FALSE),0)","v":190},{"$f":"IF(P40>0.001,IF(P40>Q40,1,0),0)","v":0},{"$f":"IF(ISBLANK(C40),\" \",IF((H40+K40+N40) >0.001,IF((J40+M40+R40)>=1,\"YES\",\"NO\"),\"INCOMPLETE INFORMATION\"))","v":"YES"},{"$f":"IF(ISBLANK(N40),0,IF(S40=\"YES\",0,IF(A40 = \"Equipment Cleaning\",1,0)))","v":0},null,null,null,{"$f":"IF(ISBLANK(W40),0,V40*W40/100)","v":0},null,{"$f":"IF(ISBLANK(Y40),0,V40*Y40/100)","v":0}]
["Surface Preparation","Sherwin Williams (Proline Paints)","Isopropyl Alcohol","R6K20",{"$f":"IF(ISBLANK(B41),\" \",CONCATENATE($A41,\": \",$B41,\" \",$C41,\" \",$D41))","v":"Surface Preparation: Sherwin Williams (Proline Paints) Isopropyl Alcohol R6K20"},6.51,"lb/gal",{"$f":"IF($G41 = \"lb/gal\",($F41*120),$F41)","v":781.19999999999993},{"$f":"IF(H41>1,VLOOKUP($A41,'[1]Marine Coating Limits'!$I$3:$L$4,2,FALSE),0)","v":200},{"$f":"IF(H41>0.001,IF($H41>$I41,0,1),0)","v":0},33,{"$f":"IF(K41>0.01,VLOOKUP(A41,'[1]Marine Coating Limits'!$I$3:$L$4,4,FALSE),0)","v":45},{"$f":"IF(K41>0.0001,IF(K41>L41,0,1),0)","v":1},178,"F",{"$f":"IF($O41 = \"F\",CONVERT($N41,\"F\",\"C\"),$N41)","v":81.111111111111114},{"$f":"IF(P41>0.01,VLOOKUP(A41,'[1]Marine Coating Limits'!$I$3:$L$4,3,FALSE),0)","v":190},{"$f":"IF(P41>0.001,IF(P41>Q41,1,0),0)","v":0},{"$f":"IF(ISBLANK(C41),\" \",IF((H41+K41+N41) >0.001,IF((J41+M41+R41)>=1,\"YES\",\"NO\"),\"INCOMPLETE INFORMATION\"))","v":"YES"},{"$f":"IF(ISBLANK(N41),0,IF(S41=\"YES\",0,IF(A41 = \"Equipment Cleaning\",1,0)))","v":0},null,null,null,{"$f":"IF(ISBLANK(W41),0,V41*W41/100)","v":0},null,{"$f":"IF(ISBLANK(Y41),0,V41*Y41/100)","v":0}]
["Surface Preparation","Sherwin Williams (Proline Paints)","Methyl Amyl Ketone","R6K30",{"$f":"IF(ISBLANK(B42),\" \",CONCATENATE($A42,\": \",$B42,\" \",$C42,\" \",$D42))","v":"Surface Preparation: Sherwin Williams (Proline Paints) Methyl Amyl Ketone R6K30"},810,"g/l",{"$f":"IF($G42 = \"lb/gal\",($F42*120),$F42)","v":810},{"$f":"IF(H42>1,VLOOKUP($A42,'[1]Marine Coating Limits'!$I$3:$L$4,2,FALSE),0)","v":200},{"$f":"IF(H42>0.001,IF($H42>$I42,0,1),0)","v":0},3.855,{"$f":"IF(K42>0.01,VLOOKUP(A42,'[1]Marine Coating Limits'!$I$3:$L$4,4,FALSE),0)","v":45},{"$f":"IF(K42>0.0001,IF(K42>L42,0,1),0)","v":1},297,"F",{"$f":"IF($O42 = \"F\",CONVERT($N42,\"F\",\"C\"),$N42)","v":147.22222222222223},{"$f":"IF(P42>0.01,VLOOKUP(A42,'[1]Marine Coating Limits'!$I$3:$L$4,3,FALSE),0)","v":190},{"$f":"IF(P42>0.001,IF(P42>Q42,1,0),0)","v":0},{"$f":"IF(ISBLANK(C42),\" \",IF((H42+K42+N42) >0.001,IF((J42+M42+R42)>=1,\"YES\",\"NO\"),\"INCOMPLETE INFORMATION\"))","v":"YES"},{"$f":"IF(ISBLANK(N42),0,IF(S42=\"YES\",0,IF(A42 = \"Equipment Cleaning\",1,0)))","v":0},null,null,null,{"$f":"IF(ISBLANK(W42),0,V42*W42/100)","v":0},null,{"$f":"IF(ISBLANK(Y42),0,V42*Y42/100)","v":0}]
["Surface Preparation","Sherwin Williams (Proline Paints)","NO. 8 Thinner Expoxy Reducer",8,{"$f":"IF(ISBLANK(B43),\" \",CONCATENATE($A43,\": \",$B43,\" \",$C43,\" \",$D43))","v":"Surface Preparation: Sherwin Williams (Proline Paints) NO. 8 Thinner Expoxy Reducer 8"},838,"g/l",{"$f":"IF($G43 = \"lb/gal\",($F43*120),$F43)","v":838},{"$f":"IF(H43>1,VLOOKUP($A43,'[1]Marine Coating Limits'!$I$3:$L$4,2,FALSE),0)","v":200},{"$f":"IF(H43>0.001,IF($H43>$I43,0,1),0)","v":0},4.5,{"$f":"IF(K43>0.01,VLOOKUP(A43,'[1]Marine Coating Limits'!$I$3:$L$4,4,FALSE),0)","v":45},{"$f":"IF(K43>0.0001,IF(K43>L43,0,1),0)","v":1},243,"F",{"$f":"IF($O43 = \"F\",CONVERT($N43,\"F\",\"C\"),$N43)","v":117.22222222222221},{"$f":"IF(P43>0.01,VLOOKUP(A43,'[1]Marine Coating Limits'!$I$3:$L$4,3,FALSE),0)","v":190},{"$f":"IF(P43>0.001,IF(P43>Q43,1,0),0)","v":0},{"$f":"IF(ISBLANK(C43),\" \",IF((H43+K43+N43) >0.001,IF((J43+M43+R43)>=1,\"YES\",\"NO\"),\"INCOMPLETE INFORMATION\"))","v":"YES"},{"$f":"IF(ISBLANK(N43),0,IF(S43=\"YES\",0,IF(A43 = \"Equipment Cleaning\",1,0)))","v":0},null,null,null,{"$f":"IF(ISBLANK(W43),0,V43*W43/100)","v":0},null,{"$f":"IF(ISBLANK(Y43),0,V43*Y43/100)","v":0}]
["Surface Preparation","Sunshine Makers, Inc.","Simple Green",13012,{"$f":"IF(ISBLANK(B44),\" \",CONCATENATE($A44,\": \",$B44,\" \",$C44,\" \",$D44))","v":"Surface Preparation: Sunshine Makers, Inc. Simple Green 13012"},28,"g/l",28,200,1,18,45,1,210,"F",{"$f":"IF($O44 = \"F\",CONVERT($N44,\"F\",\"C\"),$N44)","v":98.888888888888886},{"$f":"IF(P44>0.01,VLOOKUP(A44,'[1]Marine Coating Limits'!$I$3:$L$4,3,FALSE),0)","v":190},{"$f":"IF(P44>0.001,IF(P44>Q44,1,0),0)","v":0},{"$f":"IF(ISBLANK(C44),\" \",IF((H44+K44+N44) >0.001,IF((J44+M44+R44)>=1,\"YES\",\"NO\"),\"INCOMPLETE INFORMATION\"))","v":"YES"},{"$f":"IF(ISBLANK(N44),0,IF(S44=\"YES\",0,IF(A44 = \"Equipment Cleaning\",1,0)))","v":0},null,null,null,{"$f":"IF(ISBLANK(W44),0,V44*W44/100)","v":0},null,{"$f":"IF(ISBLANK(Y44),0,V44*Y44/100)","v":0}]
[null,null,null,null,{"$f":"IF(ISBLANK(B45),\" \",CONCATENATE($A45,\": \",$B45,\" \",$C45,\" \",$D45))","v":" "},null,null,{"$f":"IF($G45 = \"lb/gal\",($F45*120),$F45)","v":0},{"$f":"IF(H45>1,VLOOKUP($A45,'[1]Marine Coating Limits'!$I$3:$L$4,2,FALSE),0)","v":0},{"$f":"IF(H45>0.001,IF($H45>$I45,0,1),0)","v":0},null,{"$f":"IF(K45>0.01,VLOOKUP(A45,'[1]Marine Coating Limits'!$I$3:$L$4,4,FALSE),0)","v":0},{"$f":"IF(K45>0.0001,IF(K45>L45,0,1),0)","v":0},null,null,{"$f":"IF($O45 = \"F\",CONVERT($N45,\"F\",\"C\"),$N45)","v":0},{"$f":"IF(P45>0.01,VLOOKUP(A45,'[1]Marine Coating Limits'!$I$3:$L$4,3,FALSE),0)","v":0},{"$f":"IF(P45>0.001,IF(P45>Q45,1,0),0)","v":0},{"$f":"IF(ISBLANK(C45),\" \",IF((H45+K45+N45) >0.001,IF((J45+M45+R45)>=1,\"YES\",\"NO\"),\"INCOMPLETE INFORMATION\"))","v":" "},{"$f":"IF(ISBLANK(N45),0,IF(S45=\"YES\",0,IF(A45 = \"Equipment Cleaning\",1,0)))","v":0},null,null,null,{"$f":"IF(ISBLANK(W45),0,V45*W45/100)","v":0},null,{"$f":"IF(ISBLANK(Y45),0,V45*Y45/100)","v":0}]
[null,null,null,null,{"$f":"IF(ISBLANK(B46),\" \",CONCATENATE($A46,\": \",$B46,\" \",$C46,\" \",$D46))","v":" "},null,null,{"$f":"IF($G46 = \"lb/gal\",($F46*120),$F46)","v":0},{"$f":"IF(H46>1,VLOOKUP($A46,'[1]Marine Coating Limits'!$I$3:$L$4,2,FALSE),0)","v":0},{"$f":"IF(H46>0.001,IF($H46>$I46,0,1),0)","v":0},null,{"$f":"IF(K46>0.01,VLOOKUP(A46,'[1]Marine Coating Limits'!$I$3:$L$4,4,FALSE),0)","v":0},{"$f":"IF(K46>0.0001,IF(K46>L46,0,1),0)","v":0},null,null,{"$f":"IF($O46 = \"F\",CONVERT($N46,\"F\",\"C\"),$N46)","v":0},{"$f":"IF(P46>0.01,VLOOKUP(A46,'[1]Marine Coating Limits'!$I$3:$L$4,3,FALSE),0)","v":0},{"$f":"IF(P46>0.001,IF(P46>Q46,1,0),0)","v":0},{"$f":"IF(ISBLANK(C46),\" \",IF((H46+K46+N46) >0.001,IF((J46+M46+R46)>=1,\"YES\",\"NO\"),\"INCOMPLETE INFORMATION\"))","v":" "},{"$f":"IF(ISBLANK(N46),0,IF(S46=\"YES\",0,IF(A46 = \"Equipment Cleaning\",1,0)))","v":0},null,null,null,{"$f":"IF(ISBLANK(W46),0,V46*W46/100)","v":0},null,{"$f":"IF(ISBLANK(Y46),0,V46*Y46/100)","v":0}]
[null,null,null,null,{"$f":"IF(ISBLANK(B47),\" \",CONCATENATE($A47,\": \",$B47,\" \",$C47,\" \",$D47))","v":" "},null,null,{"$f":"IF($G47 = \"lb/gal\",($F47*120),$F47)","v":0},{"$f":"IF(H47>1,VLOOKUP($A47,'[1]Marine Coating Limits'!$I$3:$L$4,2,FALSE),0)","v":0},{"$f":"IF(H47>0.001,IF($H47>$I47,0,1),0)","v":0},null,{"$f":"IF(K47>0.01,VLOOKUP(A47,'[1]Marine Coating Limits'!$I$3:$L$4,4,FALSE),0)","v":0},{"$f":"IF(K47>0.0001,IF(K47>L47,0,1),0)","v":0},null,null,{"$f":"IF($O47 = \"F\",CONVERT($N47,\"F\",\"C\"),$N47)","v":0},{"$f":"IF(P47>0.01,VLOOKUP(A47,'[1]Marine Coating Limits'!$I$3:$L$4,3,FALSE),0)","v":0},{"$f":"IF(P47>0.001,IF(P47>Q47,1,0),0)","v":0},{"$f":"IF(ISBLANK(C47),\" \",IF((H47+K47+N47) >0.001,IF((J47+M47+R47)>=1,\"YES\",\"NO\"),\"INCOMPLETE INFORMATION\"))","v":" "},{"$f":"IF(ISBLANK(N47),0,IF(S47=\"YES\",0,IF(A47 = \"Equipment Cleaning\",1,0)))","v":0},null,null,null,{"$f":"IF(ISBLANK(W47),0,V47*W47/100)","v":0},null,{"$f":"IF(ISBLANK(Y47),0,V47*Y47/100)","v":0}]
[null,null,null,null,{"$f":"IF(ISBLANK(B48),\" \",CONCATENATE($A48,\": \",$B48,\" \",$C48,\" \",$D48))","v":" "},null,null,{"$f":"IF($G48 = \"lb/gal\",($F48*120),$F48)","v":0},{"$f":"IF(H48>1,VLOOKUP($A48,'[1]Marine Coating Limits'!$I$3:$L$4,2,FALSE),0)","v":0},{"$f":"IF(H48>0.001,IF($H48>$I48,0,1),0)","v":0},null,{"$f":"IF(K48>0.01,VLOOKUP(A48,'[1]Marine Coating Limits'!$I$3:$L$4,4,FALSE),0)","v":0},{"$f":"IF(K48>0.0001,IF(K48>L48,0,1),0)","v":0},null,null,{"$f":"IF($O48 = \"F\",CONVERT($N48,\"F\",\"C\"),$N48)","v":0},{"$f":"IF(P48>0.01,VLOOKUP(A48,'[1]Marine Coating Limits'!$I$3:$L$4,3,FALSE),0)","v":0},{"$f":"IF(P48>0.001,IF(P48>Q48,1,0),0)","v":0},{"$f":"IF(ISBLANK(C48),\" \",IF((H48+K48+N48) >0.001,IF((J48+M48+R48)>=1,\"YES\",\"NO\"),\"INCOMPLETE INFORMATION\"))","v":" "},{"$f":"IF(ISBLANK(N48),0,IF(S48=\"YES\",0,IF(A48 = \"Equipment Cleaning\",1,0)))","v":0},null,null,null,{"$f":"IF(ISBLANK(W48),0,V48*W48/100)","v":0},null,{"$f":"IF(ISBLANK(Y48),0,V48*Y48/100)","v":0}]
[null,null,null,null,{"$f":"IF(ISBLANK(B49),\" \",CONCATENATE($A49,\": \",$B49,\" \",$C49,\" \",$D49))","v":" "},null,null,{"$f":"IF($G49 = \"lb/gal\",($F49*120),$F49)","v":0},{"$f":"IF(H49>1,VLOOKUP($A49,'[1]Marine Coating Limits'!$I$3:$L$4,2,FALSE),0)","v":0},{"$f":"IF(H49>0.001,IF($H49>$I49,0,1),0)","v":0},null,{"$f":"IF(K49>0.01,VLOOKUP(A49,'[1]Marine Coating Limits'!$I$3:$L$4,4,FALSE),0)","v":0},{"$f":"IF(K49>0.0001,IF(K49>L49,0,1),0)","v":0},null,null,{"$f":"IF($O49 = \"F\",CONVERT($N49,\"F\",\"C\"),$N49)","v":0},{"$f":"IF(P49>0.01,VLOOKUP(A49,'[1]Marine Coating Limits'!$I$3:$L$4,3,FALSE),0)","v":0},{"$f":"IF(P49>0.001,IF(P49>Q49,1,0),0)","v":0},{"$f":"IF(ISBLANK(C49),\" \",IF((H49+K49+N49) >0.001,IF((J49+M49+R49)>=1,\"YES\",\"NO\"),\"INCOMPLETE INFORMATION\"))","v":" "},{"$f":"IF(ISBLANK(N49),0,IF(S49=\"YES\",0,IF(A49 = \"Equipment Cleaning\",1,0)))","v":0},null,null,null,{"$f":"IF(ISBLANK(W49),0,V49*W49/100)","v":0},null,{"$f":"IF(ISBLANK(Y49),0,V49*Y49/100)","v":0}]
[null,null,null,null,{"$f":"IF(ISBLANK(B50),\" \",CONCATENATE($A50,\": \",$B50,\" \",$C50,\" \",$D50))","v":" "},null,null,{"$f":"IF($G50 = \"lb/gal\",($F50*120),$F50)","v":0},{"$f":"IF(H50>1,VLOOKUP($A50,'[1]Marine Coating Limits'!$I$3:$L$4,2,FALSE),0)","v":0},{"$f":"IF(H50>0.001,IF($H50>$I50,0,1),0)","v":0},null,{"$f":"IF(K50>0.01,VLOOKUP(A50,'[1]Marine Coating Limits'!$I$3:$L$4,4,FALSE),0)","v":0},{"$f":"IF(K50>0.0001,IF(K50>L50,0,1),0)","v":0},null,null,{"$f":"IF($O50 = \"F\",CONVERT($N50,\"F\",\"C\"),$N50)","v":0},{"$f":"IF(P50>0.01,VLOOKUP(A50,'[1]Marine Coating Limits'!$I$3:$L$4,3,FALSE),0)","v":0},{"$f":"IF(P50>0.001,IF(P50>Q50,1,0),0)","v":0},{"$f":"IF(ISBLANK(C50),\" \",IF((H50+K50+N50) >0.001,IF((J50+M50+R50)>=1,\"YES\",\"NO\"),\"INCOMPLETE INFORMATION\"))","v":" "},{"$f":"IF(ISBLANK(N50),0,IF(S50=\"YES\",0,IF(A50 = \"Equipment Cleaning\",1,0)))","v":0},null,null,null,{"$f":"IF(ISBLANK(W50),0,V50*W50/100)","v":0},null,{"$f":"IF(ISBLANK(Y50),0,V50*Y50/100)","v":0}]
[null,null,null,null,{"$f":"IF(ISBLANK(B51),\" \",CONCATENATE($A51,\": \",$B51,\" \",$C51,\" \",$D51))","v":" "},null,null,{"$f":"IF($G51 = \"lb/gal\",($F51*120),$F51)","v":0},{"$f":"IF(H51>1,VLOOKUP($A51,'[1]Marine Coating Limits'!$I$3:$L$4,2,FALSE),0)","v":0},{"$f":"IF(H51>0.001,IF($H51>$I51,0,1),0)","v":0},null,{"$f":"IF(K51>0.01,VLOOKUP(A51,'[1]Marine Coating Limits'!$I$3:$L$4,4,FALSE),0)","v":0},{"$f":"IF(K51>0.0001,IF(K51>L51,0,1),0)","v":0},null,null,{"$f":"IF($O51 = \"F\",CONVERT($N51,\"F\",\"C\"),$N51)","v":0},{"$f":"IF(P51>0.01,VLOOKUP(A51,'[1]Marine Coating Limits'!$I$3:$L$4,3,FALSE),0)","v":0},{"$f":"IF(P51>0.001,IF(P51>Q51,1,0),0)","v":0},{"$f":"IF(ISBLANK(C51),\" \",IF((H51+K51+N51) >0.001,IF((J51+M51+R51)>=1,\"YES\",\"NO\"),\"INCOMPLETE INFORMATION\"))","v":" "},{"$f":"IF(ISBLANK(N51),0,IF(S51=\"YES\",0,IF(A51 = \"Equipment Cleaning\",1,0)))","v":0},null,null,null,{"$f":"IF(ISBLANK(W51),0,V51*W51/100)","v":0},null,{"$f":"IF(ISBLANK(Y51),0,V51*Y51/100)","v":0}]
[null,null,null,null,{"$f":"IF(ISBLANK(B52),\" \",CONCATENATE($A52,\": \",$B52,\" \",$C52,\" \",$D52))","v":" "},null,null,{"$f":"IF($G52 = \"lb/gal\",($F52*120),$F52)","v":0},{"$f":"IF(H52>1,VLOOKUP($A52,'[1]Marine Coating Limits'!$I$3:$L$4,2,FALSE),0)","v":0},{"$f":"IF(H52>0.001,IF($H52>$I52,0,1),0)","v":0},null,{"$f":"IF(K52>0.01,VLOOKUP(A52,'[1]Marine Coating Limits'!$I$3:$L$4,4,FALSE),0)","v":0},{"$f":"IF(K52>0.0001,IF(K52>L52,0,1),0)","v":0},null,null,{"$f":"IF($O52 = \"F\",CONVERT($N52,\"F\",\"C\"),$N52)","v":0},{"$f":"IF(P52>0.01,VLOOKUP(A52,'[1]Marine Coating Limits'!$I$3:$L$4,3,FALSE),0)","v":0},{"$f":"IF(P52>0.001,IF(P52>Q52,1,0),0)","v":0},{"$f":"IF(ISBLANK(C52),\" \",IF((H52+K52+N52) >0.001,IF((J52+M52+R52)>=1,\"YES\",\"NO\"),\"INCOMPLETE INFORMATION\"))","v":" "},{"$f":"IF(ISBLANK(N52),0,IF(S52=\"YES\",0,IF(A52 = \"Equipment Cleaning\",1,0)))","v":0},null,null,null,{"$f":"IF(ISBLANK(W52),0,V52*W52/100)","v":0},null,{"$f":"IF(ISBLANK(Y52),0,V52*Y52/100)","v":0}]
[null,null,null,null,{"$f":"IF(ISBLANK(B53),\" \",CONCATENATE($A53,\": \",$B53,\" \",$C53,\" \",$D53))","v":" "},null,null,{"$f":"IF($G53 = \"lb/gal\",($F53*120),$F53)","v":0},{"$f":"IF(H53>1,VLOOKUP($A53,'[1]Marine Coating Limits'!$I$3:$L$4,2,FALSE),0)","v":0},{"$f":"IF(H53>0.001,IF($H53>$I53,0,1),0)","v":0},null,{"$f":"IF(K53>0.01,VLOOKUP(A53,'[1]Marine Coating Limits'!$I$3:$L$4,4,FALSE),0)","v":0},{"$f":"IF(K53>0.0001,IF(K53>L53,0,1),0)","v":0},null,null,{"$f":"IF($O53 = \"F\",CONVERT($N53,\"F\",\"C\"),$N53)","v":0},{"$f":"IF(P53>0.01,VLOOKUP(A53,'[1]Marine Coating Limits'!$I$3:$L$4,3,FALSE),0)","v":0},{"$f":"IF(P53>0.001,IF(P53>Q53,1,0),0)","v":0},{"$f":"IF(ISBLANK(C53),\" \",IF((H53+K53+N53) >0.001,IF((J53+M53+R53)>=1,\"YES\",\"NO\"),\"INCOMPLETE INFORMATION\"))","v":" "},{"$f":"IF(ISBLANK(N53),0,IF(S53=\"YES\",0,IF(A53 = \"Equipment Cleaning\",1,0)))","v":0},null,null,null,{"$f":"IF(ISBLANK(W53),0,V53*W53/100)","v":0},null,{"$f":"IF(ISBLANK(Y53),0,V53*Y53/100)","v":0}]
[null,null,null,null,{"$f":"IF(ISBLANK(B54),\" \",CONCATENATE($A54,\": \",$B54,\" \",$C54,\" \",$D54))","v":" "},null,null,{"$f":"IF($G54 = \"lb/gal\",($F54*120),$F54)","v":0},{"$f":"IF(H54>1,VLOOKUP($A54,'[1]Marine Coating Limits'!$I$3:$L$4,2,FALSE),0)","v":0},{"$f":"IF(H54>0.001,IF($H54>$I54,0,1),0)","v":0},null,{"$f":"IF(K54>0.01,VLOOKUP(A54,'[1]Marine Coating Limits'!$I$3:$L$4,4,FALSE),0)","v":0},{"$f":"IF(K54>0.0001,IF(K54>L54,0,1),0)","v":0},null,null,{"$f":"IF($O54 = \"F\",CONVERT($N54,\"F\",\"C\"),$N54)","v":0},{"$f":"IF(P54>0.01,VLOOKUP(A54,'[1]Marine Coating Limits'!$I$3:$L$4,3,FALSE),0)","v":0},{"$f":"IF(P54>0.001,IF(P54>Q54,1,0),0)","v":0},{"$f":"IF(ISBLANK(C54),\" \",IF((H54+K54+N54) >0.001,IF((J54+M54+R54)>=1,\"YES\",\"NO\"),\"INCOMPLETE INFORMATION\"))","v":" "},{"$f":"IF(ISBLANK(N54),0,IF(S54=\"YES\",0,IF(A54 = \"Equipment Cleaning\",1,0)))","v":0},null,null,null,{"$f":"IF(ISBLANK(W54),0,V54*W54/100)","v":0},null,{"$f":"IF(ISBLANK(Y54),0,V54*Y54/100)","v":0}]
[null,null,null,null,{"$f":"IF(ISBLANK(B55),\" \",CONCATENATE($A55,\": \",$B55,\" \",$C55,\" \",$D55))","v":" "},null,null,{"$f":"IF($G55 = \"lb/gal\",($F55*120),$F55)","v":0},{"$f":"IF(H55>1,VLOOKUP($A55,'[1]Marine Coating Limits'!$I$3:$L$4,2,FALSE),0)","v":0},{"$f":"IF(H55>0.001,IF($H55>$I55,0,1),0)","v":0},null,{"$f":"IF(K55>0.01,VLOOKUP(A55,'[1]Marine Coating Limits'!$I$3:$L$4,4,FALSE),0)","v":0},{"$f":"IF(K55>0.0001,IF(K55>L55,0,1),0)","v":0},null,null,{"$f":"IF($O55 = \"F\",CONVERT($N55,\"F\",\"C\"),$N55)","v":0},{"$f":"IF(P55>0.01,VLOOKUP(A55,'[1]Marine Coating Limits'!$I$3:$L$4,3,FALSE),0)","v":0},{"$f":"IF(P55>0.001,IF(P55>Q55,1,0),0)","v":0},{"$f":"IF(ISBLANK(C55),\" \",IF((H55+K55+N55) >0.001,IF((J55+M55+R55)>=1,\"YES\",\"NO\"),\"INCOMPLETE INFORMATION\"))","v":" "},{"$f":"IF(ISBLANK(N55),0,IF(S55=\"YES\",0,IF(A55 = \"Equipment Cleaning\",1,0)))","v":0},null,null,null,{"$f":"IF(ISBLANK(W55),0,V55*W55/100)","v":0},null,{"$f":"IF(ISBLANK(Y55),0,V55*Y55/100)","v":0}]
[null,null,null,null,{"$f":"IF(ISBLANK(B56),\" \",CONCATENATE($A56,\": \",$B56,\" \",$C56,\" \",$D56))","v":" "},null,null,{"$f":"IF($G56 = \"lb/gal\",($F56*120),$F56)","v":0},{"$f":"IF(H56>1,VLOOKUP($A56,'[1]Marine Coating Limits'!$I$3:$L$4,2,FALSE),0)","v":0},{"$f":"IF(H56>0.001,IF($H56>$I56,0,1),0)","v":0},null,{"$f":"IF(K56>0.01,VLOOKUP(A56,'[1]Marine Coating Limits'!$I$3:$L$4,4,FALSE),0)","v":0},{"$f":"IF(K56>0.0001,IF(K56>L56,0,1),0)","v":0},null,null,{"$f":"IF($O56 = \"F\",CONVERT($N56,\"F\",\"C\"),$N56)","v":0},{"$f":"IF(P56>0.01,VLOOKUP(A56,'[1]Marine Coating Limits'!$I$3:$L$4,3,FALSE),0)","v":0},{"$f":"IF(P56>0.001,IF(P56>Q56,1,0),0)","v":0},{"$f":"IF(ISBLANK(C56),\" \",IF((H56+K56+N56) >0.001,IF((J56+M56+R56)>=1,\"YES\",\"NO\"),\"INCOMPLETE INFORMATION\"))","v":" "},{"$f":"IF(ISBLANK(N56),0,IF(S56=\"YES\",0,IF(A56 = \"Equipment Cleaning\",1,0)))","v":0},null,null,null,{"$f":"IF(ISBLANK(W56),0,V56*W56/100)","v":0},null,{"$f":"IF(ISBLANK(Y56),0,V56*Y56/100)","v":0}]
[null,null,null,null,{"$f":"IF(ISBLANK(B57),\" \",CONCATENATE($A57,\": \",$B57,\" \",$C57,\" \",$D57))","v":" "},null,null,{"$f":"IF($G57 = \"lb/gal\",($F57*120),$F57)","v":0},{"$f":"IF(H57>1,VLOOKUP($A57,'[1]Marine Coating Limits'!$I$3:$L$4,2,FALSE),0)","v":0},{"$f":"IF(H57>0.001,IF($H57>$I57,0,1),0)","v":0},null,{"$f":"IF(K57>0.01,VLOOKUP(A57,'[1]Marine Coating Limits'!$I$3:$L$4,4,FALSE),0)","v":0},{"$f":"IF(K57>0.0001,IF(K57>L57,0,1),0)","v":0},null,null,{"$f":"IF($O57 = \"F\",CONVERT($N57,\"F\",\"C\"),$N57)","v":0},{"$f":"IF(P57>0.01,VLOOKUP(A57,'[1]Marine Coating Limits'!$I$3:$L$4,3,FALSE),0)","v":0},{"$f":"IF(P57>0.001,IF(P57>Q57,1,0),0)","v":0},{"$f":"IF(ISBLANK(C57),\" \",IF((H57+K57+N57) >0.001,IF((J57+M57+R57)>=1,\"YES\",\"NO\"),\"INCOMPLETE INFORMATION\"))","v":" "},{"$f":"IF(ISBLANK(N57),0,IF(S57=\"YES\",0,IF(A57 = \"Equipment Cleaning\",1,0)))","v":0},null,null,null,{"$f":"IF(ISBLANK(W57),0,V57*W57/100)","v":0},null,{"$f":"IF(ISBLANK(Y57),0,V57*Y57/100)","v":0}]
[null,null,null,null,{"$f":"IF(ISBLANK(B58),\" \",CONCATENATE($A58,\": \",$B58,\" \",$C58,\" \",$D58))","v":" "},null,null,{"$f":"IF($G58 = \"lb/gal\",($F58*120),$F58)","v":0},{"$f":"IF(H58>1,VLOOKUP($A58,'[1]Marine Coating Limits'!$I$3:$L$4,2,FALSE),0)","v":0},{"$f":"IF(H58>0.001,IF($H58>$I58,0,1),0)","v":0},null,{"$f":"IF(K58>0.01,VLOOKUP(A58,'[1]Marine Coating Limits'!$I$3:$L$4,4,FALSE),0)","v":0},{"$f":"IF(K58>0.0001,IF(K58>L58,0,1),0)","v":0},null,null,{"$f":"IF($O58 = \"F\",CONVERT($N58,\"F\",\"C\"),$N58)","v":0},{"$f":"IF(P58>0.01,VLOOKUP(A58,'[1]Marine Coating Limits'!$I$3:$L$4,3,FALSE),0)","v":0},{"$f":"IF(P58>0.001,IF(P58>Q58,1,0),0)","v":0},{"$f":"IF(ISBLANK(C58),\" \",IF((H58+K58+N58) >0.001,IF((J58+M58+R58)>=1,\"YES\",\"NO\"),\"INCOMPLETE INFORMATION\"))","v":" "},{"$f":"IF(ISBLANK(N58),0,IF(S58=\"YES\",0,IF(A58 = \"Equipment Cleaning\",1,0)))","v":0},null,null,null,{"$f":"IF(ISBLANK(W58),0,V58*W58/100)","v":0},null,{"$f":"IF(ISBLANK(Y58),0,V58*Y58/100)","v":0}]
[null,null,null,null,{"$f":"IF(ISBLANK(B59),\" \",CONCATENATE($A59,\": \",$B59,\" \",$C59,\" \",$D59))","v":" "},null,null,{"$f":"IF($G59 = \"lb/gal\",($F59*120),$F59)","v":0},{"$f":"IF(H59>1,VLOOKUP($A59,'[1]Marine Coating Limits'!$I$3:$L$4,2,FALSE),0)","v":0},{"$f":"IF(H59>0.001,IF($H59>$I59,0,1),0)","v":0},null,{"$f":"IF(K59>0.01,VLOOKUP(A59,'[1]Marine Coating Limits'!$I$3:$L$4,4,FALSE),0)","v":0},{"$f":"IF(K59>0.0001,IF(K59>L59,0,1),0)","v":0},null,null,{"$f":"IF($O59 = \"F\",CONVERT($N59,\"F\",\"C\"),$N59)","v":0},{"$f":"IF(P59>0.01,VLOOKUP(A59,'[1]Marine Coating Limits'!$I$3:$L$4,3,FALSE),0)","v":0},{"$f":"IF(P59>0.001,IF(P59>Q59,1,0),0)","v":0},{"$f":"IF(ISBLANK(C59),\" \",IF((H59+K59+N59) >0.001,IF((J59+M59+R59)>=1,\"YES\",\"NO\"),\"INCOMPLETE INFORMATION\"))","v":" "},{"$f":"IF(ISBLANK(N59),0,IF(S59=\"YES\",0,IF(A59 = \"Equipment Cleaning\",1,0)))","v":0},null,null,null,{"$f":"IF(ISBLANK(W59),0,V59*W59/100)","v":0},null,{"$f":"IF(ISBLANK(Y59),0,V59*Y59/100)","v":0}]
[null,null,null,null,{"$f":"IF(ISBLANK(B60),\" \",CONCATENATE($A60,\": \",$B60,\" \",$C60,\" \",$D60))","v":" "},null,null,{"$f":"IF($G60 = \"lb/gal\",($F60*120),$F60)","v":0},{"$f":"IF(H60>1,VLOOKUP($A60,'[1]Marine Coating Limits'!$I$3:$L$4,2,FALSE),0)","v":0},{"$f":"IF(H60>0.001,IF($H60>$I60,0,1),0)","v":0},null,{"$f":"IF(K60>0.01,VLOOKUP(A60,'[1]Marine Coating Limits'!$I$3:$L$4,4,FALSE),0)","v":0},{"$f":"IF(K60>0.0001,IF(K60>L60,0,1),0)","v":0},null,null,{"$f":"IF($O60 = \"F\",CONVERT($N60,\"F\",\"C\"),$N60)","v":0},{"$f":"IF(P60>0.01,VLOOKUP(A60,'[1]Marine Coating Limits'!$I$3:$L$4,3,FALSE),0)","v":0},{"$f":"IF(P60>0.001,IF(P60>Q60,1,0),0)","v":0},{"$f":"IF(ISBLANK(C60),\" \",IF((H60+K60+N60) >0.001,IF((J60+M60+R60)>=1,\"YES\",\"NO\"),\"INCOMPLETE INFORMATION\"))","v":" "},{"$f":"IF(ISBLANK(N60),0,IF(S60=\"YES\",0,IF(A60 = \"Equipment Cleaning\",1,0)))","v":0},null,null,null,{"$f":"IF(ISBLANK(W60),0,V60*W60/100)","v":0},null,{"$f":"IF(ISBLANK(Y60),0,V60*Y60/100)","v":0}]
[null,null,null,null,{"$f":"IF(ISBLANK(B61),\" \",CONCATENATE($A61,\": \",$B61,\" \",$C61,\" \",$D61))","v":" "},null,null,{"$f":"IF($G61 = \"lb/gal\",($F61*120),$F61)","v":0},{"$f":"IF(H61>1,VLOOKUP($A61,'[1]Marine Coating Limits'!$I$3:$L$4,2,FALSE),0)","v":0},{"$f":"IF(H61>0.001,IF($H61>$I61,0,1),0)","v":0},null,{"$f":"IF(K61>0.01,VLOOKUP(A61,'[1]Marine Coating Limits'!$I$3:$L$4,4,FALSE),0)","v":0},{"$f":"IF(K61>0.0001,IF(K61>L61,0,1),0)","v":0},null,null,{"$f":"IF($O61 = \"F\",CONVERT($N61,\"F\",\"C\"),$N61)","v":0},{"$f":"IF(P61>0.01,VLOOKUP(A61,'[1]Marine Coating Limits'!$I$3:$L$4,3,FALSE),0)","v":0},{"$f":"IF(P61>0.001,IF(P61>Q61,1,0),0)","v":0},{"$f":"IF(ISBLANK(C61),\" \",IF((H61+K61+N61) >0.001,IF((J61+M61+R61)>=1,\"YES\",\"NO\"),\"INCOMPLETE INFORMATION\"))","v":" "},{"$f":"IF(ISBLANK(N61),0,IF(S61=\"YES\",0,IF(A61 = \"Equipment Cleaning\",1,0)))","v":0},null,null,null,{"$f":"IF(ISBLANK(W61),0,V61*W61/100)","v":0},null,{"$f":"IF(ISBLANK(Y61),0,V61*Y61/100)","v":0}]
[null,null,null,null,{"$f":"IF(ISBLANK(B62),\" \",CONCATENATE($A62,\": \",$B62,\" \",$C62,\" \",$D62))","v":" "},null,null,{"$f":"IF($G62 = \"lb/gal\",($F62*120),$F62)","v":0},{"$f":"IF(H62>1,VLOOKUP($A62,'[1]Marine Coating Limits'!$I$3:$L$4,2,FALSE),0)","v":0},{"$f":"IF(H62>0.001,IF($H62>$I62,0,1),0)","v":0},null,{"$f":"IF(K62>0.01,VLOOKUP(A62,'[1]Marine Coating Limits'!$I$3:$L$4,4,FALSE),0)","v":0},{"$f":"IF(K62>0.0001,IF(K62>L62,0,1),0)","v":0},null,null,{"$f":"IF($O62 = \"F\",CONVERT($N62,\"F\",\"C\"),$N62)","v":0},{"$f":"IF(P62>0.01,VLOOKUP(A62,'[1]Marine Coating Limits'!$I$3:$L$4,3,FALSE),0)","v":0},{"$f":"IF(P62>0.001,IF(P62>Q62,1,0),0)","v":0},{"$f":"IF(ISBLANK(C62),\" \",IF((H62+K62+N62) >0.001,IF((J62+M62+R62)>=1,\"YES\",\"NO\"),\"INCOMPLETE INFORMATION\"))","v":" "},{"$f":"IF(ISBLANK(N62),0,IF(S62=\"YES\",0,IF(A62 = \"Equipment Cleaning\",1,0)))","v":0},null,null,null,{"$f":"IF(ISBLANK(W62),0,V62*W62/100)","v":0},null,{"$f":"IF(ISBLANK(Y62),0,V62*Y62/100)","v":0}]
[null,null,null,null,{"$f":"IF(ISBLANK(B63),\" \",CONCATENATE($A63,\": \",$B63,\" \",$C63,\" \",$D63))","v":" "},null,null,{"$f":"IF($G63 = \"lb/gal\",($F63*120),$F63)","v":0},{"$f":"IF(H63>1,VLOOKUP($A63,'[1]Marine Coating Limits'!$I$3:$L$4,2,FALSE),0)","v":0},{"$f":"IF(H63>0.001,IF($H63>$I63,0,1),0)","v":0},null,{"$f":"IF(K63>0.01,VLOOKUP(A63,'[1]Marine Coating Limits'!$I$3:$L$4,4,FALSE),0)","v":0},{"$f":"IF(K63>0.0001,IF(K63>L63,0,1),0)","v":0},null,null,{"$f":"IF($O63 = \"F\",CONVERT($N63,\"F\",\"C\"),$N63)","v":0},{"$f":"IF(P63>0.01,VLOOKUP(A63,'[1]Marine Coating Limits'!$I$3:$L$4,3,FALSE),0)","v":0},{"$f":"IF(P63>0.001,IF(P63>Q63,1,0),0)","v":0},{"$f":"IF(ISBLANK(C63),\" \",IF((H63+K63+N63) >0.001,IF((J63+M63+R63)>=1,\"YES\",\"NO\"),\"INCOMPLETE INFORMATION\"))","v":" "},{"$f":"IF(ISBLANK(N63),0,IF(S63=\"YES\",0,IF(A63 = \"Equipment Cleaning\",1,0)))","v":0},null,null,null,{"$f":"IF(ISBLANK(W63),0,V63*W63/100)","v":0},null,{"$f":"IF(ISBLANK(Y63),0,V63*Y63/100)","v":0}]
[null,null,null,null,{"$f":"IF(ISBLANK(B64),\" \",CONCATENATE($A64,\": \",$B64,\" \",$C64,\" \",$D64))","v":" "},null,null,{"$f":"IF($G64 = \"lb/gal\",($F64*120),$F64)","v":0},{"$f":"IF(H64>1,VLOOKUP($A64,'[1]Marine Coating Limits'!$I$3:$L$4,2,FALSE),0)","v":0},{"$f":"IF(H64>0.001,IF($H64>$I64,0,1),0)","v":0},null,{"$f":"IF(K64>0.01,VLOOKUP(A64,'[1]Marine Coating Limits'!$I$3:$L$4,4,FALSE),0)","v":0},{"$f":"IF(K64>0.0001,IF(K64>L64,0,1),0)","v":0},null,null,{"$f":"IF($O64 = \"F\",CONVERT($N64,\"F\",\"C\"),$N64)","v":0},{"$f":"IF(P64>0.01,VLOOKUP(A64,'[1]Marine Coating Limits'!$I$3:$L$4,3,FALSE),0)","v":0},{"$f":"IF(P64>0.001,IF(P64>Q64,1,0),0)","v":0},{"$f":"IF(ISBLANK(C64),\" \",IF((H64+K64+N64) >0.001,IF((J64+M64+R64)>=1,\"YES\",\"NO\"),\"INCOMPLETE INFORMATION\"))","v":" "},{"$f":"IF(ISBLANK(N64),0,IF(S64=\"YES\",0,IF(A64 = \"Equipment Cleaning\",1,0)))","v":0},null,null,null,{"$f":"IF(ISBLANK(W64),0,V64*W64/100)","v":0},null,{"$f":"IF(ISBLANK(Y64),0,V64*Y64/100)","v":0}]
[null,null,null,null,{"$f":"IF(ISBLANK(B65),\" \",CONCATENATE($A65,\": \",$B65,\" \",$C65,\" \",$D65))","v":" "},null,null,{"$f":"IF($G65 = \"lb/gal\",($F65*120),$F65)","v":0},{"$f":"IF(H65>1,VLOOKUP($A65,'[1]Marine Coating Limits'!$I$3:$L$4,2,FALSE),0)","v":0},{"$f":"IF(H65>0.001,IF($H65>$I65,0,1),0)","v":0},null,{"$f":"IF(K65>0.01,VLOOKUP(A65,'[1]Marine Coating Limits'!$I$3:$L$4,4,FALSE),0)","v":0},{"$f":"IF(K65>0.0001,IF(K65>L65,0,1),0)","v":0},null,null,{"$f":"IF($O65 = \"F\",CONVERT($N65,\"F\",\"C\"),$N65)","v":0},{"$f":"IF(P65>0.01,VLOOKUP(A65,'[1]Marine Coating Limits'!$I$3:$L$4,3,FALSE),0)","v":0},{"$f":"IF(P65>0.001,IF(P65>Q65,1,0),0)","v":0},{"$f":"IF(ISBLANK(C65),\" \",IF((H65+K65+N65) >0.001,IF((J65+M65+R65)>=1,\"YES\",\"NO\"),\"INCOMPLETE INFORMATION\"))","v":" "},{"$f":"IF(ISBLANK(N65),0,IF(S65=\"YES\",0,IF(A65 = \"Equipment Cleaning\",1,0)))","v":0},null,null,null,{"$f":"IF(ISBLANK(W65),0,V65*W65/100)","v":0},null,{"$f":"IF(ISBLANK(Y65),0,V65*Y65/100)","v":0}]
[null,null,null,null,{"$f":"IF(ISBLANK(B66),\" \",CONCATENATE($A66,\": \",$B66,\" \",$C66,\" \",$D66))","v":" "},null,null,{"$f":"IF($G66 = \"lb/gal\",($F66*120),$F66)","v":0},{"$f":"IF(H66>1,VLOOKUP($A66,'[1]Marine Coating Limits'!$I$3:$L$4,2,FALSE),0)","v":0},{"$f":"IF(H66>0.001,IF($H66>$I66,0,1),0)","v":0},null,{"$f":"IF(K66>0.01,VLOOKUP(A66,'[1]Marine Coating Limits'!$I$3:$L$4,4,FALSE),0)","v":0},{"$f":"IF(K66>0.0001,IF(K66>L66,0,1),0)","v":0},null,null,{"$f":"IF($O66 = \"F\",CONVERT($N66,\"F\",\"C\"),$N66)","v":0},{"$f":"IF(P66>0.01,VLOOKUP(A66,'[1]Marine Coating Limits'!$I$3:$L$4,3,FALSE),0)","v":0},{"$f":"IF(P66>0.001,IF(P66>Q66,1,0),0)","v":0},{"$f":"IF(ISBLANK(C66),\" \",IF((H66+K66+N66) >0.001,IF((J66+M66+R66)>=1,\"YES\",\"NO\"),\"INCOMPLETE INFORMATION\"))","v":" "},{"$f":"IF(ISBLANK(N66),0,IF(S66=\"YES\",0,IF(A66 = \"Equipment Cleaning\",1,0)))","v":0},null,null,null,{"$f":"IF(ISBLANK(W66),0,V66*W66/100)","v":0},null,{"$f":"IF(ISBLANK(Y66),0,V66*Y66/100)","v":0}]
[null,null,null,null,{"$f":"IF(ISBLANK(B67),\" \",CONCATENATE($A67,\": \",$B67,\" \",$C67,\" \",$D67))","v":" "},null,null,{"$f":"IF($G67 = \"lb/gal\",($F67*120),$F67)","v":0},{"$f":"IF(H67>1,VLOOKUP($A67,'[1]Marine Coating Limits'!$I$3:$L$4,2,FALSE),0)","v":0},{"$f":"IF(H67>0.001,IF($H67>$I67,0,1),0)","v":0},null,{"$f":"IF(K67>0.01,VLOOKUP(A67,'[1]Marine Coating Limits'!$I$3:$L$4,4,FALSE),0)","v":0},{"$f":"IF(K67>0.0001,IF(K67>L67,0,1),0)","v":0},null,null,{"$f":"IF($O67 = \"F\",CONVERT($N67,\"F\",\"C\"),$N67)","v":0},{"$f":"IF(P67>0.01,VLOOKUP(A67,'[1]Marine Coating Limits'!$I$3:$L$4,3,FALSE),0)","v":0},{"$f":"IF(P67>0.001,IF(P67>Q67,1,0),0)","v":0},{"$f":"IF(ISBLANK(C67),\" \",IF((H67+K67+N67) >0.001,IF((J67+M67+R67)>=1,\"YES\",\"NO\"),\"INCOMPLETE INFORMATION\"))","v":" "},{"$f":"IF(ISBLANK(N67),0,IF(S67=\"YES\",0,IF(A67 = \"Equipment Cleaning\",1,0)))","v":0},null,null,null,{"$f":"IF(ISBLANK(W67),0,V67*W67/100)","v":0},null,{"$f":"IF(ISBLANK(Y67),0,V67*Y67/100)","v":0}]
[null,null,null,null,{"$f":"IF(ISBLANK(B68),\" \",CONCATENATE($A68,\": \",$B68,\" \",$C68,\" \",$D68))","v":" "},null,null,{"$f":"IF($G68 = \"lb/gal\",($F68*120),$F68)","v":0},{"$f":"IF(H68>1,VLOOKUP($A68,'[1]Marine Coating Limits'!$I$3:$L$4,2,FALSE),0)","v":0},{"$f":"IF(H68>0.001,IF($H68>$I68,0,1),0)","v":0},null,{"$f":"IF(K68>0.01,VLOOKUP(A68,'[1]Marine Coating Limits'!$I$3:$L$4,4,FALSE),0)","v":0},{"$f":"IF(K68>0.0001,IF(K68>L68,0,1),0)","v":0},null,null,{"$f":"IF($O68 = \"F\",CONVERT($N68,\"F\",\"C\"),$N68)","v":0},{"$f":"IF(P68>0.01,VLOOKUP(A68,'[1]Marine Coating Limits'!$I$3:$L$4,3,FALSE),0)","v":0},{"$f":"IF(P68>0.001,IF(P68>Q68,1,0),0)","v":0},{"$f":"IF(ISBLANK(C68),\" \",IF((H68+K68+N68) >0.001,IF((J68+M68+R68)>=1,\"YES\",\"NO\"),\"INCOMPLETE INFORMATION\"))","v":" "},{"$f":"IF(ISBLANK(N68),0,IF(S68=\"YES\",0,IF(A68 = \"Equipment Cleaning\",1,0)))","v":0},null,null,null,{"$f":"IF(ISBLANK(W68),0,V68*W68/100)","v":0},null,{"$f":"IF(ISBLANK(Y68),0,V68*Y68/100)","v":0}]
[null,null,null,null,{"$f":"IF(ISBLANK(B69),\" \",CONCATENATE($A69,\": \",$B69,\" \",$C69,\" \",$D69))","v":" "},null,null,{"$f":"IF($G69 = \"lb/gal\",($F69*120),$F69)","v":0},{"$f":"IF(H69>1,VLOOKUP($A69,'[1]Marine Coating Limits'!$I$3:$L$4,2,FALSE),0)","v":0},{"$f":"IF(H69>0.001,IF($H69>$I69,0,1),0)","v":0},null,{"$f":"IF(K69>0.01,VLOOKUP(A69,'[1]Marine Coating Limits'!$I$3:$L$4,4,FALSE),0)","v":0},{"$f":"IF(K69>0.0001,IF(K69>L69,0,1),0)","v":0},null,null,{"$f":"IF($O69 = \"F\",CONVERT($N69,\"F\",\"C\"),$N69)","v":0},{"$f":"IF(P69>0.01,VLOOKUP(A69,'[1]Marine Coating Limits'!$I$3:$L$4,3,FALSE),0)","v":0},{"$f":"IF(P69>0.001,IF(P69>Q69,1,0),0)","v":0},{"$f":"IF(ISBLANK(C69),\" \",IF((H69+K69+N69) >0.001,IF((J69+M69+R69)>=1,\"YES\",\"NO\"),\"INCOMPLETE INFORMATION\"))","v":" "},{"$f":"IF(ISBLANK(N69),0,IF(S69=\"YES\",0,IF(A69 = \"Equipment Cleaning\",1,0)))","v":0},null,null,null,{"$f":"IF(ISBLANK(W69),0,V69*W69/100)","v":0},null,{"$f":"IF(ISBLANK(Y69),0,V69*Y69/100)","v":0}]
[null,null,null,null,{"$f":"IF(ISBLANK(B70),\" \",CONCATENATE($A70,\": \",$B70,\" \",$C70,\" \",$D70))","v":" "},null,null,{"$f":"IF($G70 = \"lb/gal\",($F70*120),$F70)","v":0},{"$f":"IF(H70>1,VLOOKUP($A70,'[1]Marine Coating Limits'!$I$3:$L$4,2,FALSE),0)","v":0},{"$f":"IF(H70>0.001,IF($H70>$I70,0,1),0)","v":0},null,{"$f":"IF(K70>0.01,VLOOKUP(A70,'[1]Marine Coating Limits'!$I$3:$L$4,4,FALSE),0)","v":0},{"$f":"IF(K70>0.0001,IF(K70>L70,0,1),0)","v":0},null,null,{"$f":"IF($O70 = \"F\",CONVERT($N70,\"F\",\"C\"),$N70)","v":0},{"$f":"IF(P70>0.01,VLOOKUP(A70,'[1]Marine Coating Limits'!$I$3:$L$4,3,FALSE),0)","v":0},{"$f":"IF(P70>0.001,IF(P70>Q70,1,0),0)","v":0},{"$f":"IF(ISBLANK(C70),\" \",IF((H70+K70+N70) >0.001,IF((J70+M70+R70)>=1,\"YES\",\"NO\"),\"INCOMPLETE INFORMATION\"))","v":" "},{"$f":"IF(ISBLANK(N70),0,IF(S70=\"YES\",0,IF(A70 = \"Equipment Cleaning\",1,0)))","v":0},null,null,null,{"$f":"IF(ISBLANK(W70),0,V70*W70/100)","v":0},null,{"$f":"IF(ISBLANK(Y70),0,V70*Y70/100)","v":0}]
[null,null,null,null,{"$f":"IF(ISBLANK(B71),\" \",CONCATENATE($A71,\": \",$B71,\" \",$C71,\" \",$D71))","v":" "},null,null,{"$f":"IF($G71 = \"lb/gal\",($F71*120),$F71)","v":0},{"$f":"IF(H71>1,VLOOKUP($A71,'[1]Marine Coating Limits'!$I$3:$L$4,2,FALSE),0)","v":0},{"$f":"IF(H71>0.001,IF($H71>$I71,0,1),0)","v":0},null,{"$f":"IF(K71>0.01,VLOOKUP(A71,'[1]Marine Coating Limits'!$I$3:$L$4,4,FALSE),0)","v":0},{"$f":"IF(K71>0.0001,IF(K71>L71,0,1),0)","v":0},null,null,{"$f":"IF($O71 = \"F\",CONVERT($N71,\"F\",\"C\"),$N71)","v":0},{"$f":"IF(P71>0.01,VLOOKUP(A71,'[1]Marine Coating Limits'!$I$3:$L$4,3,FALSE),0)","v":0},{"$f":"IF(P71>0.001,IF(P71>Q71,1,0),0)","v":0},{"$f":"IF(ISBLANK(C71),\" \",IF((H71+K71+N71) >0.001,IF((J71+M71+R71)>=1,\"YES\",\"NO\"),\"INCOMPLETE INFORMATION\"))","v":" "},{"$f":"IF(ISBLANK(N71),0,IF(S71=\"YES\",0,IF(A71 = \"Equipment Cleaning\",1,0)))","v":0},null,null,null,{"$f":"IF(ISBLANK(W71),0,V71*W71/100)","v":0},null,{"$f":"IF(ISBLANK(Y71),0,V71*Y71/100)","v":0}]
[null,null,null,null,{"$f":"IF(ISBLANK(B72),\" \",CONCATENATE($A72,\": \",$B72,\" \",$C72,\" \",$D72))","v":" "},null,null,{"$f":"IF($G72 = \"lb/gal\",($F72*120),$F72)","v":0},{"$f":"IF(H72>1,VLOOKUP($A72,'[1]Marine Coating Limits'!$I$3:$L$4,2,FALSE),0)","v":0},{"$f":"IF(H72>0.001,IF($H72>$I72,0,1),0)","v":0},null,{"$f":"IF(K72>0.01,VLOOKUP(A72,'[1]Marine Coating Limits'!$I$3:$L$4,4,FALSE),0)","v":0},{"$f":"IF(K72>0.0001,IF(K72>L72,0,1),0)","v":0},null,null,{"$f":"IF($O72 = \"F\",CONVERT($N72,\"F\",\"C\"),$N72)","v":0},{"$f":"IF(P72>0.01,VLOOKUP(A72,'[1]Marine Coating Limits'!$I$3:$L$4,3,FALSE),0)","v":0},{"$f":"IF(P72>0.001,IF(P72>Q72,1,0),0)","v":0},{"$f":"IF(ISBLANK(C72),\" \",IF((H72+K72+N72) >0.001,IF((J72+M72+R72)>=1,\"YES\",\"NO\"),\"INCOMPLETE INFORMATION\"))","v":" "},{"$f":"IF(ISBLANK(N72),0,IF(S72=\"YES\",0,IF(A72 = \"Equipment Cleaning\",1,0)))","v":0},null,null,null,{"$f":"IF(ISBLANK(W72),0,V72*W72/100)","v":0},null,{"$f":"IF(ISBLANK(Y72),0,V72*Y72/100)","v":0}]
[null,null,null,null,{"$f":"IF(ISBLANK(B73),\" \",CONCATENATE($A73,\": \",$B73,\" \",$C73,\" \",$D73))","v":" "},null,null,{"$f":"IF($G73 = \"lb/gal\",($F73*120),$F73)","v":0},{"$f":"IF(H73>1,VLOOKUP($A73,'[1]Marine Coating Limits'!$I$3:$L$4,2,FALSE),0)","v":0},{"$f":"IF(H73>0.001,IF($H73>$I73,0,1),0)","v":0},null,{"$f":"IF(K73>0.01,VLOOKUP(A73,'[1]Marine Coating Limits'!$I$3:$L$4,4,FALSE),0)","v":0},{"$f":"IF(K73>0.0001,IF(K73>L73,0,1),0)","v":0},null,null,{"$f":"IF($O73 = \"F\",CONVERT($N73,\"F\",\"C\"),$N73)","v":0},{"$f":"IF(P73>0.01,VLOOKUP(A73,'[1]Marine Coating Limits'!$I$3:$L$4,3,FALSE),0)","v":0},{"$f":"IF(P73>0.001,IF(P73>Q73,1,0),0)","v":0},{"$f":"IF(ISBLANK(C73),\" \",IF((H73+K73+N73) >0.001,IF((J73+M73+R73)>=1,\"YES\",\"NO\"),\"INCOMPLETE INFORMATION\"))","v":" "},{"$f":"IF(ISBLANK(N73),0,IF(S73=\"YES\",0,IF(A73 = \"Equipment Cleaning\",1,0)))","v":0},null,null,null,{"$f":"IF(ISBLANK(W73),0,V73*W73/100)","v":0},null,{"$f":"IF(ISBLANK(Y73),0,V73*Y73/100)","v":0}]
[null,null,null,null,{"$f":"IF(ISBLANK(B74),\" \",CONCATENATE($A74,\": \",$B74,\" \",$C74,\" \",$D74))","v":" "},null,null,{"$f":"IF($G74 = \"lb/gal\",($F74*120),$F74)","v":0},{"$f":"IF(H74>1,VLOOKUP($A74,'[1]Marine Coating Limits'!$I$3:$L$4,2,FALSE),0)","v":0},{"$f":"IF(H74>0.001,IF($H74>$I74,0,1),0)","v":0},null,{"$f":"IF(K74>0.01,VLOOKUP(A74,'[1]Marine Coating Limits'!$I$3:$L$4,4,FALSE),0)","v":0},{"$f":"IF(K74>0.0001,IF(K74>L74,0,1),0)","v":0},null,null,{"$f":"IF($O74 = \"F\",CONVERT($N74,\"F\",\"C\"),$N74)","v":0},{"$f":"IF(P74>0.01,VLOOKUP(A74,'[1]Marine Coating Limits'!$I$3:$L$4,3,FALSE),0)","v":0},{"$f":"IF(P74>0.001,IF(P74>Q74,1,0),0)","v":0},{"$f":"IF(ISBLANK(C74),\" \",IF((H74+K74+N74) >0.001,IF((J74+M74+R74)>=1,\"YES\",\"NO\"),\"INCOMPLETE INFORMATION\"))","v":" "},{"$f":"IF(ISBLANK(N74),0,IF(S74=\"YES\",0,IF(A74 = \"Equipment Cleaning\",1,0)))","v":0},null,null,null,{"$f":"IF(ISBLANK(W74),0,V74*W74/100)","v":0},null,{"$f":"IF(ISBLANK(Y74),0,V74*Y74/100)","v":0}]
[null,null,null,null,{"$f":"IF(ISBLANK(B75),\" \",CONCATENATE($A75,\": \",$B75,\" \",$C75,\" \",$D75))","v":" "},null,null,{"$f":"IF($G75 = \"lb/gal\",($F75*120),$F75)","v":0},{"$f":"IF(H75>1,VLOOKUP($A75,'[1]Marine Coating Limits'!$I$3:$L$4,2,FALSE),0)","v":0},{"$f":"IF(H75>0.001,IF($H75>$I75,0,1),0)","v":0},null,{"$f":"IF(K75>0.01,VLOOKUP(A75,'[1]Marine Coating Limits'!$I$3:$L$4,4,FALSE),0)","v":0},{"$f":"IF(K75>0.0001,IF(K75>L75,0,1),0)","v":0},null,null,{"$f":"IF($O75 = \"F\",CONVERT($N75,\"F\",\"C\"),$N75)","v":0},{"$f":"IF(P75>0.01,VLOOKUP(A75,'[1]Marine Coating Limits'!$I$3:$L$4,3,FALSE),0)","v":0},{"$f":"IF(P75>0.001,IF(P75>Q75,1,0),0)","v":0},{"$f":"IF(ISBLANK(C75),\" \",IF((H75+K75+N75) >0.001,IF((J75+M75+R75)>=1,\"YES\",\"NO\"),\"INCOMPLETE INFORMATION\"))","v":" "},{"$f":"IF(ISBLANK(N75),0,IF(S75=\"YES\",0,IF(A75 = \"Equipment Cleaning\",1,0)))","v":0},null,null,null,{"$f":"IF(ISBLANK(W75),0,V75*W75/100)","v":0},null,{"$f":"IF(ISBLANK(Y75),0,V75*Y75/100)","v":0}]
[null,null,null,null,{"$f":"IF(ISBLANK(B76),\" \",CONCATENATE($A76,\": \",$B76,\" \",$C76,\" \",$D76))","v":" "},null,null,{"$f":"IF($G76 = \"lb/gal\",($F76*120),$F76)","v":0},{"$f":"IF(H76>1,VLOOKUP($A76,'[1]Marine Coating Limits'!$I$3:$L$4,2,FALSE),0)","v":0},{"$f":"IF(H76>0.001,IF($H76>$I76,0,1),0)","v":0},null,{"$f":"IF(K76>0.01,VLOOKUP(A76,'[1]Marine Coating Limits'!$I$3:$L$4,4,FALSE),0)","v":0},{"$f":"IF(K76>0.0001,IF(K76>L76,0,1),0)","v":0},null,null,{"$f":"IF($O76 = \"F\",CONVERT($N76,\"F\",\"C\"),$N76)","v":0},{"$f":"IF(P76>0.01,VLOOKUP(A76,'[1]Marine Coating Limits'!$I$3:$L$4,3,FALSE),0)","v":0},{"$f":"IF(P76>0.001,IF(P76>Q76,1,0),0)","v":0},{"$f":"IF(ISBLANK(C76),\" \",IF((H76+K76+N76) >0.001,IF((J76+M76+R76)>=1,\"YES\",\"NO\"),\"INCOMPLETE INFORMATION\"))","v":" "},{"$f":"IF(ISBLANK(N76),0,IF(S76=\"YES\",0,IF(A76 = \"Equipment Cleaning\",1,0)))","v":0},null,null,null,{"$f":"IF(ISBLANK(W76),0,V76*W76/100)","v":0},null,{"$f":"IF(ISBLANK(Y76),0,V76*Y76/100)","v":0}]
[null,null,null,null,{"$f":"IF(ISBLANK(B77),\" \",CONCATENATE($A77,\": \",$B77,\" \",$C77,\" \",$D77))","v":" "},null,null,{"$f":"IF($G77 = \"lb/gal\",($F77*120),$F77)","v":0},{"$f":"IF(H77>1,VLOOKUP($A77,'[1]Marine Coating Limits'!$I$3:$L$4,2,FALSE),0)","v":0},{"$f":"IF(H77>0.001,IF($H77>$I77,0,1),0)","v":0},null,{"$f":"IF(K77>0.01,VLOOKUP(A77,'[1]Marine Coating Limits'!$I$3:$L$4,4,FALSE),0)","v":0},{"$f":"IF(K77>0.0001,IF(K77>L77,0,1),0)","v":0},null,null,{"$f":"IF($O77 = \"F\",CONVERT($N77,\"F\",\"C\"),$N77)","v":0},{"$f":"IF(P77>0.01,VLOOKUP(A77,'[1]Marine Coating Limits'!$I$3:$L$4,3,FALSE),0)","v":0},{"$f":"IF(P77>0.001,IF(P77>Q77,1,0),0)","v":0},{"$f":"IF(ISBLANK(C77),\" \",IF((H77+K77+N77) >0.001,IF((J77+M77+R77)>=1,\"YES\",\"NO\"),\"INCOMPLETE INFORMATION\"))","v":" "},{"$f":"IF(ISBLANK(N77),0,IF(S77=\"YES\",0,IF(A77 = \"Equipment Cleaning\",1,0)))","v":0},null,null,null,{"$f":"IF(ISBLANK(W77),0,V77*W77/100)","v":0},null,{"$f":"IF(ISBLANK(Y77),0,V77*Y77/100)","v":0}]
[null,null,null,null,{"$f":"IF(ISBLANK(B78),\" \",CONCATENATE($A78,\": \",$B78,\" \",$C78,\" \",$D78))","v":" "},null,null,{"$f":"IF($G78 = \"lb/gal\",($F78*120),$F78)","v":0},{"$f":"IF(H78>1,VLOOKUP($A78,'[1]Marine Coating Limits'!$I$3:$L$4,2,FALSE),0)","v":0},{"$f":"IF(H78>0.001,IF($H78>$I78,0,1),0)","v":0},null,{"$f":"IF(K78>0.01,VLOOKUP(A78,'[1]Marine Coating Limits'!$I$3:$L$4,4,FALSE),0)","v":0},{"$f":"IF(K78>0.0001,IF(K78>L78,0,1),0)","v":0},null,null,{"$f":"IF($O78 = \"F\",CONVERT($N78,\"F\",\"C\"),$N78)","v":0},{"$f":"IF(P78>0.01,VLOOKUP(A78,'[1]Marine Coating Limits'!$I$3:$L$4,3,FALSE),0)","v":0},{"$f":"IF(P78>0.001,IF(P78>Q78,1,0),0)","v":0},{"$f":"IF(ISBLANK(C78),\" \",IF((H78+K78+N78) >0.001,IF((J78+M78+R78)>=1,\"YES\",\"NO\"),\"INCOMPLETE INFORMATION\"))","v":" "},{"$f":"IF(ISBLANK(N78),0,IF(S78=\"YES\",0,IF(A78 = \"Equipment Cleaning\",1,0)))","v":0},null,null,null,{"$f":"IF(ISBLANK(W78),0,V78*W78/100)","v":0},null,{"$f":"IF(ISBLANK(Y78),0,V78*Y78/100)","v":0}]
[null,null,null,null,{"$f":"IF(ISBLANK(B79),\" \",CONCATENATE($A79,\": \",$B79,\" \",$C79,\" \",$D79))","v":" "},null,null,{"$f":"IF($G79 = \"lb/gal\",($F79*120),$F79)","v":0},{"$f":"IF(H79>1,VLOOKUP($A79,'[1]Marine Coating Limits'!$I$3:$L$4,2,FALSE),0)","v":0},{"$f":"IF(H79>0.001,IF($H79>$I79,0,1),0)","v":0},null,{"$f":"IF(K79>0.01,VLOOKUP(A79,'[1]Marine Coating Limits'!$I$3:$L$4,4,FALSE),0)","v":0},{"$f":"IF(K79>0.0001,IF(K79>L79,0,1),0)","v":0},null,null,{"$f":"IF($O79 = \"F\",CONVERT($N79,\"F\",\"C\"),$N79)","v":0},{"$f":"IF(P79>0.01,VLOOKUP(A79,'[1]Marine Coating Limits'!$I$3:$L$4,3,FALSE),0)","v":0},{"$f":"IF(P79>0.001,IF(P79>Q79,1,0),0)","v":0},{"$f":"IF(ISBLANK(C79),\" \",IF((H79+K79+N79) >0.001,IF((J79+M79+R79)>=1,\"YES\",\"NO\"),\"INCOMPLETE INFORMATION\"))","v":" "},{"$f":"IF(ISBLANK(N79),0,IF(S79=\"YES\",0,IF(A79 = \"Equipment Cleaning\",1,0)))","v":0},null,null,null,{"$f":"IF(ISBLANK(W79),0,V79*W79/100)","v":0},null,{"$f":"IF(ISBLANK(Y79),0,V79*Y79/100)","v":0}]
[null,null,null,null,{"$f":"IF(ISBLANK(B80),\" \",CONCATENATE($A80,\": \",$B80,\" \",$C80,\" \",$D80))","v":" "},null,null,{"$f":"IF($G80 = \"lb/gal\",($F80*120),$F80)","v":0},{"$f":"IF(H80>1,VLOOKUP($A80,'[1]Marine Coating Limits'!$I$3:$L$4,2,FALSE),0)","v":0},{"$f":"IF(H80>0.001,IF($H80>$I80,0,1),0)","v":0},null,{"$f":"IF(K80>0.01,VLOOKUP(A80,'[1]Marine Coating Limits'!$I$3:$L$4,4,FALSE),0)","v":0},{"$f":"IF(K80>0.0001,IF(K80>L80,0,1),0)","v":0},null,null,{"$f":"IF($O80 = \"F\",CONVERT($N80,\"F\",\"C\"),$N80)","v":0},{"$f":"IF(P80>0.01,VLOOKUP(A80,'[1]Marine Coating Limits'!$I$3:$L$4,3,FALSE),0)","v":0},{"$f":"IF(P80>0.001,IF(P80>Q80,1,0),0)","v":0},{"$f":"IF(ISBLANK(C80),\" \",IF((H80+K80+N80) >0.001,IF((J80+M80+R80)>=1,\"YES\",\"NO\"),\"INCOMPLETE INFORMATION\"))","v":" "},{"$f":"IF(ISBLANK(N80),0,IF(S80=\"YES\",0,IF(A80 = \"Equipment Cleaning\",1,0)))","v":0},null,null,null,{"$f":"IF(ISBLANK(W80),0,V80*W80/100)","v":0},null,{"$f":"IF(ISBLANK(Y80),0,V80*Y80/100)","v":0}]
[null,null,null,null,{"$f":"IF(ISBLANK(B81),\" \",CONCATENATE($A81,\": \",$B81,\" \",$C81,\" \",$D81))","v":" "},null,null,{"$f":"IF($G81 = \"lb/gal\",($F81*120),$F81)","v":0},{"$f":"IF(H81>1,VLOOKUP($A81,'[1]Marine Coating Limits'!$I$3:$L$4,2,FALSE),0)","v":0},{"$f":"IF(H81>0.001,IF($H81>$I81,0,1),0)","v":0},null,{"$f":"IF(K81>0.01,VLOOKUP(A81,'[1]Marine Coating Limits'!$I$3:$L$4,4,FALSE),0)","v":0},{"$f":"IF(K81>0.0001,IF(K81>L81,0,1),0)","v":0},null,null,{"$f":"IF($O81 = \"F\",CONVERT($N81,\"F\",\"C\"),$N81)","v":0},{"$f":"IF(P81>0.01,VLOOKUP(A81,'[1]Marine Coating Limits'!$I$3:$L$4,3,FALSE),0)","v":0},{"$f":"IF(P81>0.001,IF(P81>Q81,1,0),0)","v":0},{"$f":"IF(ISBLANK(C81),\" \",IF((H81+K81+N81) >0.001,IF((J81+M81+R81)>=1,\"YES\",\"NO\"),\"INCOMPLETE INFORMATION\"))","v":" "},{"$f":"IF(ISBLANK(N81),0,IF(S81=\"YES\",0,IF(A81 = \"Equipment Cleaning\",1,0)))","v":0},null,null,null,{"$f":"IF(ISBLANK(W81),0,V81*W81/100)","v":0},null,{"$f":"IF(ISBLANK(Y81),0,V81*Y81/100)","v":0}]
[null,null,null,null,{"$f":"IF(ISBLANK(B82),\" \",CONCATENATE($A82,\": \",$B82,\" \",$C82,\" \",$D82))","v":" "},null,null,{"$f":"IF($G82 = \"lb/gal\",($F82*120),$F82)","v":0},{"$f":"IF(H82>1,VLOOKUP($A82,'[1]Marine Coating Limits'!$I$3:$L$4,2,FALSE),0)","v":0},{"$f":"IF(H82>0.001,IF($H82>$I82,0,1),0)","v":0},null,{"$f":"IF(K82>0.01,VLOOKUP(A82,'[1]Marine Coating Limits'!$I$3:$L$4,4,FALSE),0)","v":0},{"$f":"IF(K82>0.0001,IF(K82>L82,0,1),0)","v":0},null,null,{"$f":"IF($O82 = \"F\",CONVERT($N82,\"F\",\"C\"),$N82)","v":0},{"$f":"IF(P82>0.01,VLOOKUP(A82,'[1]Marine Coating Limits'!$I$3:$L$4,3,FALSE),0)","v":0},{"$f":"IF(P82>0.001,IF(P82>Q82,1,0),0)","v":0},{"$f":"IF(ISBLANK(C82),\" \",IF((H82+K82+N82) >0.001,IF((J82+M82+R82)>=1,\"YES\",\"NO\"),\"INCOMPLETE INFORMATION\"))","v":" "},{"$f":"IF(ISBLANK(N82),0,IF(S82=\"YES\",0,IF(A82 = \"Equipment Cleaning\",1,0)))","v":0},null,null,null,{"$f":"IF(ISBLANK(W82),0,V82*W82/100)","v":0},null,{"$f":"IF(ISBLANK(Y82),0,V82*Y82/100)","v":0}]
[null,null,null,null,{"$f":"IF(ISBLANK(B83),\" \",CONCATENATE($A83,\": \",$B83,\" \",$C83,\" \",$D83))","v":" "},null,null,{"$f":"IF($G83 = \"lb/gal\",($F83*120),$F83)","v":0},{"$f":"IF(H83>1,VLOOKUP($A83,'[1]Marine Coating Limits'!$I$3:$L$4,2,FALSE),0)","v":0},{"$f":"IF(H83>0.001,IF($H83>$I83,0,1),0)","v":0},null,{"$f":"IF(K83>0.01,VLOOKUP(A83,'[1]Marine Coating Limits'!$I$3:$L$4,4,FALSE),0)","v":0},{"$f":"IF(K83>0.0001,IF(K83>L83,0,1),0)","v":0},null,null,{"$f":"IF($O83 = \"F\",CONVERT($N83,\"F\",\"C\"),$N83)","v":0},{"$f":"IF(P83>0.01,VLOOKUP(A83,'[1]Marine Coating Limits'!$I$3:$L$4,3,FALSE),0)","v":0},{"$f":"IF(P83>0.001,IF(P83>Q83,1,0),0)","v":0},{"$f":"IF(ISBLANK(C83),\" \",IF((H83+K83+N83) >0.001,IF((J83+M83+R83)>=1,\"YES\",\"NO\"),\"INCOMPLETE INFORMATION\"))","v":" "},{"$f":"IF(ISBLANK(N83),0,IF(S83=\"YES\",0,IF(A83 = \"Equipment Cleaning\",1,0)))","v":0},null,null,null,{"$f":"IF(ISBLANK(W83),0,V83*W83/100)","v":0},null,{"$f":"IF(ISBLANK(Y83),0,V83*Y83/100)","v":0}]
[null,null,null,null,{"$f":"IF(ISBLANK(B84),\" \",CONCATENATE($A84,\": \",$B84,\" \",$C84,\" \",$D84))","v":" "},null,null,{"$f":"IF($G84 = \"lb/gal\",($F84*120),$F84)","v":0},{"$f":"IF(H84>1,VLOOKUP($A84,'[1]Marine Coating Limits'!$I$3:$L$4,2,FALSE),0)","v":0},{"$f":"IF(H84>0.001,IF($H84>$I84,0,1),0)","v":0},null,{"$f":"IF(K84>0.01,VLOOKUP(A84,'[1]Marine Coating Limits'!$I$3:$L$4,4,FALSE),0)","v":0},{"$f":"IF(K84>0.0001,IF(K84>L84,0,1),0)","v":0},null,null,{"$f":"IF($O84 = \"F\",CONVERT($N84,\"F\",\"C\"),$N84)","v":0},{"$f":"IF(P84>0.01,VLOOKUP(A84,'[1]Marine Coating Limits'!$I$3:$L$4,3,FALSE),0)","v":0},{"$f":"IF(P84>0.001,IF(P84>Q84,1,0),0)","v":0},{"$f":"IF(ISBLANK(C84),\" \",IF((H84+K84+N84) >0.001,IF((J84+M84+R84)>=1,\"YES\",\"NO\"),\"INCOMPLETE INFORMATION\"))","v":" "},{"$f":"IF(ISBLANK(N84),0,IF(S84=\"YES\",0,IF(A84 = \"Equipment Cleaning\",1,0)))","v":0},null,null,null,{"$f":"IF(ISBLANK(W84),0,V84*W84/100)","v":0},null,{"$f":"IF(ISBLANK(Y84),0,V84*Y84/100)","v":0}]
[null,null,null,null,{"$f":"IF(ISBLANK(B85),\" \",CONCATENATE($A85,\": \",$B85,\" \",$C85,\" \",$D85))","v":" "},null,null,{"$f":"IF($G85 = \"lb/gal\",($F85*120),$F85)","v":0},{"$f":"IF(H85>1,VLOOKUP($A85,'[1]Marine Coating Limits'!$I$3:$L$4,2,FALSE),0)","v":0},{"$f":"IF(H85>0.001,IF($H85>$I85,0,1),0)","v":0},null,{"$f":"IF(K85>0.01,VLOOKUP(A85,'[1]Marine Coating Limits'!$I$3:$L$4,4,FALSE),0)","v":0},{"$f":"IF(K85>0.0001,IF(K85>L85,0,1),0)","v":0},null,null,{"$f":"IF($O85 = \"F\",CONVERT($N85,\"F\",\"C\"),$N85)","v":0},{"$f":"IF(P85>0.01,VLOOKUP(A85,'[1]Marine Coating Limits'!$I$3:$L$4,3,FALSE),0)","v":0},{"$f":"IF(P85>0.001,IF(P85>Q85,1,0),0)","v":0},{"$f":"IF(ISBLANK(C85),\" \",IF((H85+K85+N85) >0.001,IF((J85+M85+R85)>=1,\"YES\",\"NO\"),\"INCOMPLETE INFORMATION\"))","v":" "},{"$f":"IF(ISBLANK(N85),0,IF(S85=\"YES\",0,IF(A85 = \"Equipment Cleaning\",1,0)))","v":0},null,null,null,{"$f":"IF(ISBLANK(W85),0,V85*W85/100)","v":0},null,{"$f":"IF(ISBLANK(Y85),0,V85*Y85/100)","v":0}]
[null,null,null,null,{"$f":"IF(ISBLANK(B86),\" \",CONCATENATE($A86,\": \",$B86,\" \",$C86,\" \",$D86))","v":" "},null,null,{"$f":"IF($G86 = \"lb/gal\",($F86*120),$F86)","v":0},{"$f":"IF(H86>1,VLOOKUP($A86,'[1]Marine Coating Limits'!$I$3:$L$4,2,FALSE),0)","v":0},{"$f":"IF(H86>0.001,IF($H86>$I86,0,1),0)","v":0},null,{"$f":"IF(K86>0.01,VLOOKUP(A86,'[1]Marine Coating Limits'!$I$3:$L$4,4,FALSE),0)","v":0},{"$f":"IF(K86>0.0001,IF(K86>L86,0,1),0)","v":0},null,null,{"$f":"IF($O86 = \"F\",CONVERT($N86,\"F\",\"C\"),$N86)","v":0},{"$f":"IF(P86>0.01,VLOOKUP(A86,'[1]Marine Coating Limits'!$I$3:$L$4,3,FALSE),0)","v":0},{"$f":"IF(P86>0.001,IF(P86>Q86,1,0),0)","v":0},{"$f":"IF(ISBLANK(C86),\" \",IF((H86+K86+N86) >0.001,IF((J86+M86+R86)>=1,\"YES\",\"NO\"),\"INCOMPLETE INFORMATION\"))","v":" "},{"$f":"IF(ISBLANK(N86),0,IF(S86=\"YES\",0,IF(A86 = \"Equipment Cleaning\",1,0)))","v":0},null,null,null,{"$f":"IF(ISBLANK(W86),0,V86*W86/100)","v":0},null,{"$f":"IF(ISBLANK(Y86),0,V86*Y86/100)","v":0}]
[null,null,null,null,{"$f":"IF(ISBLANK(B87),\" \",CONCATENATE($A87,\": \",$B87,\" \",$C87,\" \",$D87))","v":" "},null,null,{"$f":"IF($G87 = \"lb/gal\",($F87*120),$F87)","v":0},{"$f":"IF(H87>1,VLOOKUP($A87,'[1]Marine Coating Limits'!$I$3:$L$4,2,FALSE),0)","v":0},{"$f":"IF(H87>0.001,IF($H87>$I87,0,1),0)","v":0},null,{"$f":"IF(K87>0.01,VLOOKUP(A87,'[1]Marine Coating Limits'!$I$3:$L$4,4,FALSE),0)","v":0},{"$f":"IF(K87>0.0001,IF(K87>L87,0,1),0)","v":0},null,null,{"$f":"IF($O87 = \"F\",CONVERT($N87,\"F\",\"C\"),$N87)","v":0},{"$f":"IF(P87>0.01,VLOOKUP(A87,'[1]Marine Coating Limits'!$I$3:$L$4,3,FALSE),0)","v":0},{"$f":"IF(P87>0.001,IF(P87>Q87,1,0),0)","v":0},{"$f":"IF(ISBLANK(C87),\" \",IF((H87+K87+N87) >0.001,IF((J87+M87+R87)>=1,\"YES\",\"NO\"),\"INCOMPLETE INFORMATION\"))","v":" "},{"$f":"IF(ISBLANK(N87),0,IF(S87=\"YES\",0,IF(A87 = \"Equipment Cleaning\",1,0)))","v":0},null,null,null,{"$f":"IF(ISBLANK(W87),0,V87*W87/100)","v":0},null,{"$f":"IF(ISBLANK(Y87),0,V87*Y87/100)","v":0}]
[null,null,null,null,{"$f":"IF(ISBLANK(B88),\" \",CONCATENATE($A88,\": \",$B88,\" \",$C88,\" \",$D88))","v":" "},null,null,{"$f":"IF($G88 = \"lb/gal\",($F88*120),$F88)","v":0},{"$f":"IF(H88>1,VLOOKUP($A88,'[1]Marine Coating Limits'!$I$3:$L$4,2,FALSE),0)","v":0},{"$f":"IF(H88>0.001,IF($H88>$I88,0,1),0)","v":0},null,{"$f":"IF(K88>0.01,VLOOKUP(A88,'[1]Marine Coating Limits'!$I$3:$L$4,4,FALSE),0)","v":0},{"$f":"IF(K88>0.0001,IF(K88>L88,0,1),0)","v":0},null,null,{"$f":"IF($O88 = \"F\",CONVERT($N88,\"F\",\"C\"),$N88)","v":0},{"$f":"IF(P88>0.01,VLOOKUP(A88,'[1]Marine Coating Limits'!$I$3:$L$4,3,FALSE),0)","v":0},{"$f":"IF(P88>0.001,IF(P88>Q88,1,0),0)","v":0},{"$f":"IF(ISBLANK(C88),\" \",IF((H88+K88+N88) >0.001,IF((J88+M88+R88)>=1,\"YES\",\"NO\"),\"INCOMPLETE INFORMATION\"))","v":" "},{"$f":"IF(ISBLANK(N88),0,IF(S88=\"YES\",0,IF(A88 = \"Equipment Cleaning\",1,0)))","v":0},null,null,null,{"$f":"IF(ISBLANK(W88),0,V88*W88/100)","v":0},null,{"$f":"IF(ISBLANK(Y88),0,V88*Y88/100)","v":0}]
[null,null,null,null,{"$f":"IF(ISBLANK(B89),\" \",CONCATENATE($A89,\": \",$B89,\" \",$C89,\" \",$D89))","v":" "},null,null,{"$f":"IF($G89 = \"lb/gal\",($F89*120),$F89)","v":0},{"$f":"IF(H89>1,VLOOKUP($A89,'[1]Marine Coating Limits'!$I$3:$L$4,2,FALSE),0)","v":0},{"$f":"IF(H89>0.001,IF($H89>$I89,0,1),0)","v":0},null,{"$f":"IF(K89>0.01,VLOOKUP(A89,'[1]Marine Coating Limits'!$I$3:$L$4,4,FALSE),0)","v":0},{"$f":"IF(K89>0.0001,IF(K89>L89,0,1),0)","v":0},null,null,{"$f":"IF($O89 = \"F\",CONVERT($N89,\"F\",\"C\"),$N89)","v":0},{"$f":"IF(P89>0.01,VLOOKUP(A89,'[1]Marine Coating Limits'!$I$3:$L$4,3,FALSE),0)","v":0},{"$f":"IF(P89>0.001,IF(P89>Q89,1,0),0)","v":0},{"$f":"IF(ISBLANK(C89),\" \",IF((H89+K89+N89) >0.001,IF((J89+M89+R89)>=1,\"YES\",\"NO\"),\"INCOMPLETE INFORMATION\"))","v":" "},{"$f":"IF(ISBLANK(N89),0,IF(S89=\"YES\",0,IF(A89 = \"Equipment Cleaning\",1,0)))","v":0},null,null,null,{"$f":"IF(ISBLANK(W89),0,V89*W89/100)","v":0},null,{"$f":"IF(ISBLANK(Y89),0,V89*Y89/100)","v":0}]
[null,null,null,null,{"$f":"IF(ISBLANK(B90),\" \",CONCATENATE($A90,\": \",$B90,\" \",$C90,\" \",$D90))","v":" "},null,null,{"$f":"IF($G90 = \"lb/gal\",($F90*120),$F90)","v":0},{"$f":"IF(H90>1,VLOOKUP($A90,'[1]Marine Coating Limits'!$I$3:$L$4,2,FALSE),0)","v":0},{"$f":"IF(H90>0.001,IF($H90>$I90,0,1),0)","v":0},null,{"$f":"IF(K90>0.01,VLOOKUP(A90,'[1]Marine Coating Limits'!$I$3:$L$4,4,FALSE),0)","v":0},{"$f":"IF(K90>0.0001,IF(K90>L90,0,1),0)","v":0},null,null,{"$f":"IF($O90 = \"F\",CONVERT($N90,\"F\",\"C\"),$N90)","v":0},{"$f":"IF(P90>0.01,VLOOKUP(A90,'[1]Marine Coating Limits'!$I$3:$L$4,3,FALSE),0)","v":0},{"$f":"IF(P90>0.001,IF(P90>Q90,1,0),0)","v":0},{"$f":"IF(ISBLANK(C90),\" \",IF((H90+K90+N90) >0.001,IF((J90+M90+R90)>=1,\"YES\",\"NO\"),\"INCOMPLETE INFORMATION\"))","v":" "},{"$f":"IF(ISBLANK(N90),0,IF(S90=\"YES\",0,IF(A90 = \"Equipment Cleaning\",1,0)))","v":0},null,null,null,{"$f":"IF(ISBLANK(W90),0,V90*W90/100)","v":0},null,{"$f":"IF(ISBLANK(Y90),0,V90*Y90/100)","v":0}]
[null,null,null,null,{"$f":"IF(ISBLANK(B91),\" \",CONCATENATE($A91,\": \",$B91,\" \",$C91,\" \",$D91))","v":" "},null,null,{"$f":"IF($G91 = \"lb/gal\",($F91*120),$F91)","v":0},{"$f":"IF(H91>1,VLOOKUP($A91,'[1]Marine Coating Limits'!$I$3:$L$4,2,FALSE),0)","v":0},{"$f":"IF(H91>0.001,IF($H91>$I91,0,1),0)","v":0},null,{"$f":"IF(K91>0.01,VLOOKUP(A91,'[1]Marine Coating Limits'!$I$3:$L$4,4,FALSE),0)","v":0},{"$f":"IF(K91>0.0001,IF(K91>L91,0,1),0)","v":0},null,null,{"$f":"IF($O91 = \"F\",CONVERT($N91,\"F\",\"C\"),$N91)","v":0},{"$f":"IF(P91>0.01,VLOOKUP(A91,'[1]Marine Coating Limits'!$I$3:$L$4,3,FALSE),0)","v":0},{"$f":"IF(P91>0.001,IF(P91>Q91,1,0),0)","v":0},{"$f":"IF(ISBLANK(C91),\" \",IF((H91+K91+N91) >0.001,IF((J91+M91+R91)>=1,\"YES\",\"NO\"),\"INCOMPLETE INFORMATION\"))","v":" "},{"$f":"IF(ISBLANK(N91),0,IF(S91=\"YES\",0,IF(A91 = \"Equipment Cleaning\",1,0)))","v":0},null,null,null,{"$f":"IF(ISBLANK(W91),0,V91*W91/100)","v":0},null,{"$f":"IF(ISBLANK(Y91),0,V91*Y91/100)","v":0}]
[null,null,null,null,{"$f":"IF(ISBLANK(B92),\" \",CONCATENATE($A92,\": \",$B92,\" \",$C92,\" \",$D92))","v":" "},null,null,{"$f":"IF($G92 = \"lb/gal\",($F92*120),$F92)","v":0},{"$f":"IF(H92>1,VLOOKUP($A92,'[1]Marine Coating Limits'!$I$3:$L$4,2,FALSE),0)","v":0},{"$f":"IF(H92>0.001,IF($H92>$I92,0,1),0)","v":0},null,{"$f":"IF(K92>0.01,VLOOKUP(A92,'[1]Marine Coating Limits'!$I$3:$L$4,4,FALSE),0)","v":0},{"$f":"IF(K92>0.0001,IF(K92>L92,0,1),0)","v":0},null,null,{"$f":"IF($O92 = \"F\",CONVERT($N92,\"F\",\"C\"),$N92)","v":0},{"$f":"IF(P92>0.01,VLOOKUP(A92,'[1]Marine Coating Limits'!$I$3:$L$4,3,FALSE),0)","v":0},{"$f":"IF(P92>0.001,IF(P92>Q92,1,0),0)","v":0},{"$f":"IF(ISBLANK(C92),\" \",IF((H92+K92+N92) >0.001,IF((J92+M92+R92)>=1,\"YES\",\"NO\"),\"INCOMPLETE INFORMATION\"))","v":" "},{"$f":"IF(ISBLANK(N92),0,IF(S92=\"YES\",0,IF(A92 = \"Equipment Cleaning\",1,0)))","v":0},null,null,null,{"$f":"IF(ISBLANK(W92),0,V92*W92/100)","v":0},null,{"$f":"IF(ISBLANK(Y92),0,V92*Y92/100)","v":0}]
[null,null,null,null,{"$f":"IF(ISBLANK(B93),\" \",CONCATENATE($A93,\": \",$B93,\" \",$C93,\" \",$D93))","v":" "},null,null,{"$f":"IF($G93 = \"lb/gal\",($F93*120),$F93)","v":0},{"$f":"IF(H93>1,VLOOKUP($A93,'[1]Marine Coating Limits'!$I$3:$L$4,2,FALSE),0)","v":0},{"$f":"IF(H93>0.001,IF($H93>$I93,0,1),0)","v":0},null,{"$f":"IF(K93>0.01,VLOOKUP(A93,'[1]Marine Coating Limits'!$I$3:$L$4,4,FALSE),0)","v":0},{"$f":"IF(K93>0.0001,IF(K93>L93,0,1),0)","v":0},null,null,{"$f":"IF($O93 = \"F\",CONVERT($N93,\"F\",\"C\"),$N93)","v":0},{"$f":"IF(P93>0.01,VLOOKUP(A93,'[1]Marine Coating Limits'!$I$3:$L$4,3,FALSE),0)","v":0},{"$f":"IF(P93>0.001,IF(P93>Q93,1,0),0)","v":0},{"$f":"IF(ISBLANK(C93),\" \",IF((H93+K93+N93) >0.001,IF((J93+M93+R93)>=1,\"YES\",\"NO\"),\"INCOMPLETE INFORMATION\"))","v":" "},{"$f":"IF(ISBLANK(N93),0,IF(S93=\"YES\",0,IF(A93 = \"Equipment Cleaning\",1,0)))","v":0},null,null,null,{"$f":"IF(ISBLANK(W93),0,V93*W93/100)","v":0},null,{"$f":"IF(ISBLANK(Y93),0,V93*Y93/100)","v":0}]
[null,null,null,null,{"$f":"IF(ISBLANK(B94),\" \",CONCATENATE($A94,\": \",$B94,\" \",$C94,\" \",$D94))","v":" "},null,null,{"$f":"IF($G94 = \"lb/gal\",($F94*120),$F94)","v":0},{"$f":"IF(H94>1,VLOOKUP($A94,'[1]Marine Coating Limits'!$I$3:$L$4,2,FALSE),0)","v":0},{"$f":"IF(H94>0.001,IF($H94>$I94,0,1),0)","v":0},null,{"$f":"IF(K94>0.01,VLOOKUP(A94,'[1]Marine Coating Limits'!$I$3:$L$4,4,FALSE),0)","v":0},{"$f":"IF(K94>0.0001,IF(K94>L94,0,1),0)","v":0},null,null,{"$f":"IF($O94 = \"F\",CONVERT($N94,\"F\",\"C\"),$N94)","v":0},{"$f":"IF(P94>0.01,VLOOKUP(A94,'[1]Marine Coating Limits'!$I$3:$L$4,3,FALSE),0)","v":0},{"$f":"IF(P94>0.001,IF(P94>Q94,1,0),0)","v":0},{"$f":"IF(ISBLANK(C94),\" \",IF((H94+K94+N94) >0.001,IF((J94+M94+R94)>=1,\"YES\",\"NO\"),\"INCOMPLETE INFORMATION\"))","v":" "},{"$f":"IF(ISBLANK(N94),0,IF(S94=\"YES\",0,IF(A94 = \"Equipment Cleaning\",1,0)))","v":0},null,null,null,{"$f":"IF(ISBLANK(W94),0,V94*W94/100)","v":0},null,{"$f":"IF(ISBLANK(Y94),0,V94*Y94/100)","v":0}]
[null,null,null,null,{"$f":"IF(ISBLANK(B95),\" \",CONCATENATE($A95,\": \",$B95,\" \",$C95,\" \",$D95))","v":" "},null,null,{"$f":"IF($G95 = \"lb/gal\",($F95*120),$F95)","v":0},{"$f":"IF(H95>1,VLOOKUP($A95,'[1]Marine Coating Limits'!$I$3:$L$4,2,FALSE),0)","v":0},{"$f":"IF(H95>0.001,IF($H95>$I95,0,1),0)","v":0},null,{"$f":"IF(K95>0.01,VLOOKUP(A95,'[1]Marine Coating Limits'!$I$3:$L$4,4,FALSE),0)","v":0},{"$f":"IF(K95>0.0001,IF(K95>L95,0,1),0)","v":0},null,null,{"$f":"IF($O95 = \"F\",CONVERT($N95,\"F\",\"C\"),$N95)","v":0},{"$f":"IF(P95>0.01,VLOOKUP(A95,'[1]Marine Coating Limits'!$I$3:$L$4,3,FALSE),0)","v":0},{"$f":"IF(P95>0.001,IF(P95>Q95,1,0),0)","v":0},{"$f":"IF(ISBLANK(C95),\" \",IF((H95+K95+N95) >0.001,IF((J95+M95+R95)>=1,\"YES\",\"NO\"),\"INCOMPLETE INFORMATION\"))","v":" "},{"$f":"IF(ISBLANK(N95),0,IF(S95=\"YES\",0,IF(A95 = \"Equipment Cleaning\",1,0)))","v":0},null,null,null,{"$f":"IF(ISBLANK(W95),0,V95*W95/100)","v":0},null,{"$f":"IF(ISBLANK(Y95),0,V95*Y95/100)","v":0}]
[null,null,null,null,{"$f":"IF(ISBLANK(B96),\" \",CONCATENATE($A96,\": \",$B96,\" \",$C96,\" \",$D96))","v":" "},null,null,{"$f":"IF($G96 = \"lb/gal\",($F96*120),$F96)","v":0},{"$f":"IF(H96>1,VLOOKUP($A96,'[1]Marine Coating Limits'!$I$3:$L$4,2,FALSE),0)","v":0},{"$f":"IF(H96>0.001,IF($H96>$I96,0,1),0)","v":0},null,{"$f":"IF(K96>0.01,VLOOKUP(A96,'[1]Marine Coating Limits'!$I$3:$L$4,4,FALSE),0)","v":0},{"$f":"IF(K96>0.0001,IF(K96>L96,0,1),0)","v":0},null,null,{"$f":"IF($O96 = \"F\",CONVERT($N96,\"F\",\"C\"),$N96)","v":0},{"$f":"IF(P96>0.01,VLOOKUP(A96,'[1]Marine Coating Limits'!$I$3:$L$4,3,FALSE),0)","v":0},{"$f":"IF(P96>0.001,IF(P96>Q96,1,0),0)","v":0},{"$f":"IF(ISBLANK(C96),\" \",IF((H96+K96+N96) >0.001,IF((J96+M96+R96)>=1,\"YES\",\"NO\"),\"INCOMPLETE INFORMATION\"))","v":" "},{"$f":"IF(ISBLANK(N96),0,IF(S96=\"YES\",0,IF(A96 = \"Equipment Cleaning\",1,0)))","v":0},null,null,null,{"$f":"IF(ISBLANK(W96),0,V96*W96/100)","v":0},null,{"$f":"IF(ISBLANK(Y96),0,V96*Y96/100)","v":0}]
[null,null,null,null,{"$f":"IF(ISBLANK(B97),\" \",CONCATENATE($A97,\": \",$B97,\" \",$C97,\" \",$D97))","v":" "},null,null,{"$f":"IF($G97 = \"lb/gal\",($F97*120),$F97)","v":0},{"$f":"IF(H97>1,VLOOKUP($A97,'[1]Marine Coating Limits'!$I$3:$L$4,2,FALSE),0)","v":0},{"$f":"IF(H97>0.001,IF($H97>$I97,0,1),0)","v":0},null,{"$f":"IF(K97>0.01,VLOOKUP(A97,'[1]Marine Coating Limits'!$I$3:$L$4,4,FALSE),0)","v":0},{"$f":"IF(K97>0.0001,IF(K97>L97,0,1),0)","v":0},null,null,{"$f":"IF($O97 = \"F\",CONVERT($N97,\"F\",\"C\"),$N97)","v":0},{"$f":"IF(P97>0.01,VLOOKUP(A97,'[1]Marine Coating Limits'!$I$3:$L$4,3,FALSE),0)","v":0},{"$f":"IF(P97>0.001,IF(P97>Q97,1,0),0)","v":0},{"$f":"IF(ISBLANK(C97),\" \",IF((H97+K97+N97) >0.001,IF((J97+M97+R97)>=1,\"YES\",\"NO\"),\"INCOMPLETE INFORMATION\"))","v":" "},{"$f":"IF(ISBLANK(N97),0,IF(S97=\"YES\",0,IF(A97 = \"Equipment Cleaning\",1,0)))","v":0},null,null,null,{"$f":"IF(ISBLANK(W97),0,V97*W97/100)","v":0},null,{"$f":"IF(ISBLANK(Y97),0,V97*Y97/100)","v":0}]
[null,null,null,null,{"$f":"IF(ISBLANK(B98),\" \",CONCATENATE($A98,\": \",$B98,\" \",$C98,\" \",$D98))","v":" "},null,null,{"$f":"IF($G98 = \"lb/gal\",($F98*120),$F98)","v":0},{"$f":"IF(H98>1,VLOOKUP($A98,'[1]Marine Coating Limits'!$I$3:$L$4,2,FALSE),0)","v":0},{"$f":"IF(H98>0.001,IF($H98>$I98,0,1),0)","v":0},null,{"$f":"IF(K98>0.01,VLOOKUP(A98,'[1]Marine Coating Limits'!$I$3:$L$4,4,FALSE),0)","v":0},{"$f":"IF(K98>0.0001,IF(K98>L98,0,1),0)","v":0},null,null,{"$f":"IF($O98 = \"F\",CONVERT($N98,\"F\",\"C\"),$N98)","v":0},{"$f":"IF(P98>0.01,VLOOKUP(A98,'[1]Marine Coating Limits'!$I$3:$L$4,3,FALSE),0)","v":0},{"$f":"IF(P98>0.001,IF(P98>Q98,1,0),0)","v":0},{"$f":"IF(ISBLANK(C98),\" \",IF((H98+K98+N98) >0.001,IF((J98+M98+R98)>=1,\"YES\",\"NO\"),\"INCOMPLETE INFORMATION\"))","v":" "},{"$f":"IF(ISBLANK(N98),0,IF(S98=\"YES\",0,IF(A98 = \"Equipment Cleaning\",1,0)))","v":0},null,null,null,{"$f":"IF(ISBLANK(W98),0,V98*W98/100)","v":0},null,{"$f":"IF(ISBLANK(Y98),0,V98*Y98/100)","v":0}]
[null,null,null,null,{"$f":"IF(ISBLANK(B99),\" \",CONCATENATE($A99,\": \",$B99,\" \",$C99,\" \",$D99))","v":" "},null,null,{"$f":"IF($G99 = \"lb/gal\",($F99*120),$F99)","v":0},{"$f":"IF(H99>1,VLOOKUP($A99,'[1]Marine Coating Limits'!$I$3:$L$4,2,FALSE),0)","v":0},{"$f":"IF(H99>0.001,IF($H99>$I99,0,1),0)","v":0},null,{"$f":"IF(K99>0.01,VLOOKUP(A99,'[1]Marine Coating Limits'!$I$3:$L$4,4,FALSE),0)","v":0},{"$f":"IF(K99>0.0001,IF(K99>L99,0,1),0)","v":0},null,null,{"$f":"IF($O99 = \"F\",CONVERT($N99,\"F\",\"C\"),$N99)","v":0},{"$f":"IF(P99>0.01,VLOOKUP(A99,'[1]Marine Coating Limits'!$I$3:$L$4,3,FALSE),0)","v":0},{"$f":"IF(P99>0.001,IF(P99>Q99,1,0),0)","v":0},{"$f":"IF(ISBLANK(C99),\" \",IF((H99+K99+N99) >0.001,IF((J99+M99+R99)>=1,\"YES\",\"NO\"),\"INCOMPLETE INFORMATION\"))","v":" "},{"$f":"IF(ISBLANK(N99),0,IF(S99=\"YES\",0,IF(A99 = \"Equipment Cleaning\",1,0)))","v":0},null,null,null,{"$f":"IF(ISBLANK(W99),0,V99*W99/100)","v":0},null,{"$f":"IF(ISBLANK(Y99),0,V99*Y99/100)","v":0}]
[null,null,null,null,{"$f":"IF(ISBLANK(B100),\" \",CONCATENATE($A100,\": \",$B100,\" \",$C100,\" \",$D100))","v":" "},null,null,{"$f":"IF($G100 = \"lb/gal\",($F100*120),$F100)","v":0},{"$f":"IF(H100>1,VLOOKUP($A100,'[1]Marine Coating Limits'!$I$3:$L$4,2,FALSE),0)","v":0},{"$f":"IF(H100>0.001,IF($H100>$I100,0,1),0)","v":0},null,{"$f":"IF(K100>0.01,VLOOKUP(A100,'[1]Marine Coating Limits'!$I$3:$L$4,4,FALSE),0)","v":0},{"$f":"IF(K100>0.0001,IF(K100>L100,0,1),0)","v":0},null,null,{"$f":"IF($O100 = \"F\",CONVERT($N100,\"F\",\"C\"),$N100)","v":0},{"$f":"IF(P100>0.01,VLOOKUP(A100,'[1]Marine Coating Limits'!$I$3:$L$4,3,FALSE),0)","v":0},{"$f":"IF(P100>0.001,IF(P100>Q100,1,0),0)","v":0},{"$f":"IF(ISBLANK(C100),\" \",IF((H100+K100+N100) >0.001,IF((J100+M100+R100)>=1,\"YES\",\"NO\"),\"INCOMPLETE INFORMATION\"))","v":" "},{"$f":"IF(ISBLANK(N100),0,IF(S100=\"YES\",0,IF(A100 = \"Equipment Cleaning\",1,0)))","v":0},null,null,null,{"$f":"IF(ISBLANK(W100),0,V100*W100/100)","v":0},null,{"$f":"IF(ISBLANK(Y100),0,V100*Y100/100)","v":0}]
[null,null,null,null,{"$f":"IF(ISBLANK(B101),\" \",CONCATENATE($A101,\": \",$B101,\" \",$C101,\" \",$D101))","v":" "},null,null,{"$f":"IF($G101 = \"lb/gal\",($F101*120),$F101)","v":0},{"$f":"IF(H101>1,VLOOKUP($A101,'[1]Marine Coating Limits'!$I$3:$L$4,2,FALSE),0)","v":0},{"$f":"IF(H101>0.001,IF($H101>$I101,0,1),0)","v":0},null,{"$f":"IF(K101>0.01,VLOOKUP(A101,'[1]Marine Coating Limits'!$I$3:$L$4,4,FALSE),0)","v":0},{"$f":"IF(K101>0.0001,IF(K101>L101,0,1),0)","v":0},null,null,{"$f":"IF($O101 = \"F\",CONVERT($N101,\"F\",\"C\"),$N101)","v":0},{"$f":"IF(P101>0.01,VLOOKUP(A101,'[1]Marine Coating Limits'!$I$3:$L$4,3,FALSE),0)","v":0},{"$f":"IF(P101>0.001,IF(P101>Q101,1,0),0)","v":0},{"$f":"IF(ISBLANK(C101),\" \",IF((H101+K101+N101) >0.001,IF((J101+M101+R101)>=1,\"YES\",\"NO\"),\"INCOMPLETE INFORMATION\"))","v":" "},{"$f":"IF(ISBLANK(N101),0,IF(S101=\"YES\",0,IF(A101 = \"Equipment Cleaning\",1,0)))","v":0},null,null,null,{"$f":"IF(ISBLANK(W101),0,V101*W101/100)","v":0},null,{"$f":"IF(ISBLANK(Y101),0,V101*Y101/100)","v":0}]
[null,null,null,null,{"$f":"IF(ISBLANK(B102),\" \",CONCATENATE($A102,\": \",$B102,\" \",$C102,\" \",$D102))","v":" "},null,null,{"$f":"IF($G102 = \"lb/gal\",($F102*120),$F102)","v":0},{"$f":"IF(H102>1,VLOOKUP($A102,'[1]Marine Coating Limits'!$I$3:$L$4,2,FALSE),0)","v":0},{"$f":"IF(H102>0.001,IF($H102>$I102,0,1),0)","v":0},null,{"$f":"IF(K102>0.01,VLOOKUP(A102,'[1]Marine Coating Limits'!$I$3:$L$4,4,FALSE),0)","v":0},{"$f":"IF(K102>0.0001,IF(K102>L102,0,1),0)","v":0},null,null,{"$f":"IF($O102 = \"F\",CONVERT($N102,\"F\",\"C\"),$N102)","v":0},{"$f":"IF(P102>0.01,VLOOKUP(A102,'[1]Marine Coating Limits'!$I$3:$L$4,3,FALSE),0)","v":0},{"$f":"IF(P102>0.001,IF(P102>Q102,1,0),0)","v":0},{"$f":"IF(ISBLANK(C102),\" \",IF((H102+K102+N102) >0.001,IF((J102+M102+R102)>=1,\"YES\",\"NO\"),\"INCOMPLETE INFORMATION\"))","v":" "},{"$f":"IF(ISBLANK(N102),0,IF(S102=\"YES\",0,IF(A102 = \"Equipment Cleaning\",1,0)))","v":0},null,null,null,{"$f":"IF(ISBLANK(W102),0,V102*W102/100)","v":0},null,{"$f":"IF(ISBLANK(Y102),0,V102*Y102/100)","v":0}]
[null,null,null,null,{"$f":"IF(ISBLANK(B103),\" \",CONCATENATE($A103,\": \",$B103,\" \",$C103,\" \",$D103))","v":" "},null,null,{"$f":"IF($G103 = \"lb/gal\",($F103*120),$F103)","v":0},{"$f":"IF(H103>1,VLOOKUP($A103,'[1]Marine Coating Limits'!$I$3:$L$4,2,FALSE),0)","v":0},{"$f":"IF(H103>0.001,IF($H103>$I103,0,1),0)","v":0},null,{"$f":"IF(K103>0.01,VLOOKUP(A103,'[1]Marine Coating Limits'!$I$3:$L$4,4,FALSE),0)","v":0},{"$f":"IF(K103>0.0001,IF(K103>L103,0,1),0)","v":0},null,null,{"$f":"IF($O103 = \"F\",CONVERT($N103,\"F\",\"C\"),$N103)","v":0},{"$f":"IF(P103>0.01,VLOOKUP(A103,'[1]Marine Coating Limits'!$I$3:$L$4,3,FALSE),0)","v":0},{"$f":"IF(P103>0.001,IF(P103>Q103,1,0),0)","v":0},{"$f":"IF(ISBLANK(C103),\" \",IF((H103+K103+N103) >0.001,IF((J103+M103+R103)>=1,\"YES\",\"NO\"),\"INCOMPLETE INFORMATION\"))","v":" "},{"$f":"IF(ISBLANK(N103),0,IF(S103=\"YES\",0,IF(A103 = \"Equipment Cleaning\",1,0)))","v":0},null,null,null,{"$f":"IF(ISBLANK(W103),0,V103*W103/100)","v":0},null,{"$f":"IF(ISBLANK(Y103),0,V103*Y103/100)","v":0}]
[null,null,null,null,{"$f":"IF(ISBLANK(B104),\" \",CONCATENATE($A104,\": \",$B104,\" \",$C104,\" \",$D104))","v":" "},null,null,{"$f":"IF($G104 = \"lb/gal\",($F104*120),$F104)","v":0},{"$f":"IF(H104>1,VLOOKUP($A104,'[1]Marine Coating Limits'!$I$3:$L$4,2,FALSE),0)","v":0},{"$f":"IF(H104>0.001,IF($H104>$I104,0,1),0)","v":0},null,{"$f":"IF(K104>0.01,VLOOKUP(A104,'[1]Marine Coating Limits'!$I$3:$L$4,4,FALSE),0)","v":0},{"$f":"IF(K104>0.0001,IF(K104>L104,0,1),0)","v":0},null,null,{"$f":"IF($O104 = \"F\",CONVERT($N104,\"F\",\"C\"),$N104)","v":0},{"$f":"IF(P104>0.01,VLOOKUP(A104,'[1]Marine Coating Limits'!$I$3:$L$4,3,FALSE),0)","v":0},{"$f":"IF(P104>0.001,IF(P104>Q104,1,0),0)","v":0},{"$f":"IF(ISBLANK(C104),\" \",IF((H104+K104+N104) >0.001,IF((J104+M104+R104)>=1,\"YES\",\"NO\"),\"INCOMPLETE INFORMATION\"))","v":" "},{"$f":"IF(ISBLANK(N104),0,IF(S104=\"YES\",0,IF(A104 = \"Equipment Cleaning\",1,0)))","v":0},null,null,null,{"$f":"IF(ISBLANK(W104),0,V104*W104/100)","v":0},null,{"$f":"IF(ISBLANK(Y104),0,V104*Y104/100)","v":0}]
[null,null,null,null,{"$f":"IF(ISBLANK(B105),\" \",CONCATENATE($A105,\": \",$B105,\" \",$C105,\" \",$D105))","v":" "},null,null,{"$f":"IF($G105 = \"lb/gal\",($F105*120),$F105)","v":0},{"$f":"IF(H105>1,VLOOKUP($A105,'[1]Marine Coating Limits'!$I$3:$L$4,2,FALSE),0)","v":0},{"$f":"IF(H105>0.001,IF($H105>$I105,0,1),0)","v":0},null,{"$f":"IF(K105>0.01,VLOOKUP(A105,'[1]Marine Coating Limits'!$I$3:$L$4,4,FALSE),0)","v":0},{"$f":"IF(K105>0.0001,IF(K105>L105,0,1),0)","v":0},null,null,{"$f":"IF($O105 = \"F\",CONVERT($N105,\"F\",\"C\"),$N105)","v":0},{"$f":"IF(P105>0.01,VLOOKUP(A105,'[1]Marine Coating Limits'!$I$3:$L$4,3,FALSE),0)","v":0},{"$f":"IF(P105>0.001,IF(P105>Q105,1,0),0)","v":0},{"$f":"IF(ISBLANK(C105),\" \",IF((H105+K105+N105) >0.001,IF((J105+M105+R105)>=1,\"YES\",\"NO\"),\"INCOMPLETE INFORMATION\"))","v":" "},{"$f":"IF(ISBLANK(N105),0,IF(S105=\"YES\",0,IF(A105 = \"Equipment Cleaning\",1,0)))","v":0},null,null,null,{"$f":"IF(ISBLANK(W105),0,V105*W105/100)","v":0},null,{"$f":"IF(ISBLANK(Y105),0,V105*Y105/100)","v":0}]
[null,null,null,null,{"$f":"IF(ISBLANK(B106),\" \",CONCATENATE($A106,\": \",$B106,\" \",$C106,\" \",$D106))","v":" "},null,null,{"$f":"IF($G106 = \"lb/gal\",($F106*120),$F106)","v":0},{"$f":"IF(H106>1,VLOOKUP($A106,'[1]Marine Coating Limits'!$I$3:$L$4,2,FALSE),0)","v":0},{"$f":"IF(H106>0.001,IF($H106>$I106,0,1),0)","v":0},null,{"$f":"IF(K106>0.01,VLOOKUP(A106,'[1]Marine Coating Limits'!$I$3:$L$4,4,FALSE),0)","v":0},{"$f":"IF(K106>0.0001,IF(K106>L106,0,1),0)","v":0},null,null,{"$f":"IF($O106 = \"F\",CONVERT($N106,\"F\",\"C\"),$N106)","v":0},{"$f":"IF(P106>0.01,VLOOKUP(A106,'[1]Marine Coating Limits'!$I$3:$L$4,3,FALSE),0)","v":0},{"$f":"IF(P106>0.001,IF(P106>Q106,1,0),0)","v":0},{"$f":"IF(ISBLANK(C106),\" \",IF((H106+K106+N106) >0.001,IF((J106+M106+R106)>=1,\"YES\",\"NO\"),\"INCOMPLETE INFORMATION\"))","v":" "},{"$f":"IF(ISBLANK(N106),0,IF(S106=\"YES\",0,IF(A106 = \"Equipment Cleaning\",1,0)))","v":0},null,null,null,{"$f":"IF(ISBLANK(W106),0,V106*W106/100)","v":0},null,{"$f":"IF(ISBLANK(Y106),0,V106*Y106/100)","v":0}]
[null,null,null,null,{"$f":"IF(ISBLANK(B107),\" \",CONCATENATE($A107,\": \",$B107,\" \",$C107,\" \",$D107))","v":" "},null,null,{"$f":"IF($G107 = \"lb/gal\",($F107*120),$F107)","v":0},{"$f":"IF(H107>1,VLOOKUP($A107,'[1]Marine Coating Limits'!$I$3:$L$4,2,FALSE),0)","v":0},{"$f":"IF(H107>0.001,IF($H107>$I107,0,1),0)","v":0},null,{"$f":"IF(K107>0.01,VLOOKUP(A107,'[1]Marine Coating Limits'!$I$3:$L$4,4,FALSE),0)","v":0},{"$f":"IF(K107>0.0001,IF(K107>L107,0,1),0)","v":0},null,null,{"$f":"IF($O107 = \"F\",CONVERT($N107,\"F\",\"C\"),$N107)","v":0},{"$f":"IF(P107>0.01,VLOOKUP(A107,'[1]Marine Coating Limits'!$I$3:$L$4,3,FALSE),0)","v":0},{"$f":"IF(P107>0.001,IF(P107>Q107,1,0),0)","v":0},{"$f":"IF(ISBLANK(C107),\" \",IF((H107+K107+N107) >0.001,IF((J107+M107+R107)>=1,\"YES\",\"NO\"),\"INCOMPLETE INFORMATION\"))","v":" "},{"$f":"IF(ISBLANK(N107),0,IF(S107=\"YES\",0,IF(A107 = \"Equipment Cleaning\",1,0)))","v":0},null,null,null,{"$f":"IF(ISBLANK(W107),0,V107*W107/100)","v":0},null,{"$f":"IF(ISBLANK(Y107),0,V107*Y107/100)","v":0}]

{"sheet":"4. Adhesive Reporting Form","index":3,"n_rows":82,"n_cols":22,"rows_kept":82,"cut":false,"hidden":false,"merged":[[5,11,5,13],[10,7,10,8],[12,7,12,8],[11,7,11,8],[10,11,10,14],[11,13,11,14],[7,7,9,13]]}
[null,"  "]
[null,"rev 14JAN13"]
[null,null,null,null,null,null,null,null,null,null,"Reporting Month"]
[null,null,null,null,null,null,null,null,null,null,"Reporting Year"]
[]
[null,null,null,null,null,null,null,"MONTHLY ADHESIVE USAGE FORM",null,null,"Facility where work occurred:"]
[]
[null,null,null,null,null,null,null,"I certify that the above is an accurate and complete accounting of all adhesives applied by the undersigned company at the facility listed above during the reporting month.  I further certify that all adhesive were applied in compliance with SDAPCD Rule 67.21 and in conformance with applicable permit requirements. "]
[]
[]
[null,null,null,null,null,null,"Company Name:",{"$f":"'1. INSTRUCTIONS'!B6","v":0},null,null,"Report Prepared by:",{"$f":"'1. INSTRUCTIONS'!B9","v":0}]
[null,null,null,null,null,null,"Address: ",{"$f":"'1. INSTRUCTIONS'!B7","v":0},null,null,"Phone:",{"$f":"'1. INSTRUCTIONS'!H8","v":0},"E-Mail:",{"$f":"'1. INSTRUCTIONS'!H9","v":0}]
[null,null,null,null,null,null,"City, Zip:",{"$f":"'1. INSTRUCTIONS'!B8","v":0},null,null,"Report Date:"]
[]
[]
["Hiring Agency","Company Name","Location (Naval Installation)","Prime Contractor","Vessel Name","Date Applied","Adhesive Product Name","Manufacturer/Supplier","Total Amount Used","Unit","VOC Content","VOC Unit","Product Category from SDAPCD Rule 67.21"]
[null,{"$f":"'1. INSTRUCTIONS'!B6:J6","v":0},null,null,null,null,null,{"$f":"IF((COUNTBLANK($G17) = 1),\"\", (VLOOKUP($G17,'2. Master Adhesive List'!$A$12:$H$62,2,FALSE)))","v":""},null,null,{"$f":"IF((COUNTBLANK($G17) = 1),\"\", (VLOOKUP($G17,'2. Master Adhesive List'!$A$12:$H$62,3,FALSE)))","v":""},{"$f":"IF((COUNTBLANK($G17) = 1),\"\", (VLOOKUP($G17,'2. Master Adhesive List'!$A$12:$H$42,4,TRUE)))","v":""},{"$f":"IF((COUNTBLANK($G17) = 1),\"\", (VLOOKUP($G17,'2. Master Adhesive List'!$A$12:$H$62,6,TRUE)))","v":""}]
[null,{"$f":"'1. INSTRUCTIONS'!B6:J6","v":0},null,null,null,null,null,{"$f":"IF((COUNTBLANK($G18) = 1),\"\", (VLOOKUP($G18,'2. Master Adhesive List'!$A$12:$H$62,2,FALSE)))","v":""},null,null,{"$f":"IF((COUNTBLANK($G18) = 1),\"\", (VLOOKUP($G18,'2. Master Adhesive List'!$A$12:$H$62,3,FALSE)))","v":""},{"$f":"IF((COUNTBLANK($G18) = 1),\"\", (VLOOKUP($G18,'2. Master Adhesive List'!$A$12:$H$42,4,TRUE)))","v":""},{"$f":"IF((COUNTBLANK($G18) = 1),\"\", (VLOOKUP($G18,'2. Master Adhesive List'!$A$12:$H$62,6,TRUE)))","v":""}]
[null,{"$f":"'1. INSTRUCTIONS'!B6:J6","v":0},null,null,null,null,null,{"$f":"IF((COUNTBLANK($G19) = 1),\"\", (VLOOKUP($G19,'2. Master Adhesive List'!$A$12:$H$62,2,FALSE)))","v":""},null,null,{"$f":"IF((COUNTBLANK($G19) = 1),\"\", (VLOOKUP($G19,'2. Master Adhesive List'!$A$12:$H$62,3,FALSE)))","v":""},{"$f":"IF((COUNTBLANK($G19) = 1),\"\", (VLOOKUP($G19,'2. Master Adhesive List'!$A$12:$H$42,4,TRUE)))","v":""},{"$f":"IF((COUNTBLANK($G19) = 1),\"\", (VLOOKUP($G19,'2. Master Adhesive List'!$A$12:$H$62,6,TRUE)))","v":""}]
[null,{"$f":"'1. INSTRUCTIONS'!B6:J6","v":0},null,null,null,null,null,{"$f":"IF((COUNTBLANK($G20) = 1),\"\", (VLOOKUP($G20,'2. Master Adhesive List'!$A$12:$H$62,2,FALSE)))","v":""},null,null,{"$f":"IF((COUNTBLANK($G20) = 1),\"\", (VLOOKUP($G20,'2. Master Adhesive List'!$A$12:$H$62,3,FALSE)))","v":""},{"$f":"IF((COUNTBLANK($G20) = 1),\"\", (VLOOKUP($G20,'2. Master Adhesive List'!$A$12:$H$42,4,TRUE)))","v":""},{"$f":"IF((COUNTBLANK($G20) = 1),\"\", (VLOOKUP($G20,'2. Master Adhesive List'!$A$12:$H$62,6,TRUE)))","v":""}]
[null,{"$f":"'1. INSTRUCTIONS'!B6:J6","v":0},null,null,null,null,null,{"$f":"IF((COUNTBLANK($G21) = 1),\"\", (VLOOKUP($G21,'2. Master Adhesive List'!$A$12:$H$62,2,FALSE)))","v":""},null,null,{"$f":"IF((COUNTBLANK($G21) = 1),\"\", (VLOOKUP($G21,'2. Master Adhesive List'!$A$12:$H$62,3,FALSE)))","v":""},{"$f":"IF((COUNTBLANK($G21) = 1),\"\", (VLOOKUP($G21,'2. Master Adhesive List'!$A$12:$H$42,4,TRUE)))","v":""},{"$f":"IF((COUNTBLANK($G21) = 1),\"\", (VLOOKUP($G21,'2. Master Adhesive List'!$A$12:$H$62,6,TRUE)))","v":""}]
[null,{"$f":"'1. INSTRUCTIONS'!B6:J6","v":0},null,null,null,null,null,{"$f":"IF((COUNTBLANK($G22) = 1),\"\", (VLOOKUP($G22,'2. Master Adhesive List'!$A$12:$H$62,2,FALSE)))","v":""},null,null,{"$f":"IF((COUNTBLANK($G22) = 1),\"\", (VLOOKUP($G22,'2. Master Adhesive List'!$A$12:$H$62,3,FALSE)))","v":""},{"$f":"IF((COUNTBLANK($G22) = 1),\"\", (VLOOKUP($G22,'2. Master Adhesive List'!$A$12:$H$42,4,TRUE)))","v":""},{"$f":"IF((COUNTBLANK($G22) = 1),\"\", (VLOOKUP($G22,'2. Master Adhesive List'!$A$12:$H$62,6,TRUE)))","v":""}]
[null,{"$f":"'1. INSTRUCTIONS'!B6:J6","v":0},null,null,null,null,null,{"$f":"IF((COUNTBLANK($G23) = 1),\"\", (VLOOKUP($G23,'2. Master Adhesive List'!$A$12:$H$62,2,FALSE)))","v":""},null,null,{"$f":"IF((COUNTBLANK($G23) = 1),\"\", (VLOOKUP($G23,'2. Master Adhesive List'!$A$12:$H$62,3,FALSE)))","v":""},{"$f":"IF((COUNTBLANK($G23) = 1),\"\", (VLOOKUP($G23,'2. Master Adhesive List'!$A$12:$H$42,4,TRUE)))","v":""},{"$f":"IF((COUNTBLANK($G23) = 1),\"\", (VLOOKUP($G23,'2. Master Adhesive List'!$A$12:$H$62,6,TRUE)))","v":""}]
[null,{"$f":"'1. INSTRUCTIONS'!B6:J6","v":0},null,null,null,null,null,{"$f":"IF((COUNTBLANK($G24) = 1),\"\", (VLOOKUP($G24,'2. Master Adhesive List'!$A$12:$H$62,2,FALSE)))","v":""},null,null,{"$f":"IF((COUNTBLANK($G24) = 1),\"\", (VLOOKUP($G24,'2. Master Adhesive List'!$A$12:$H$62,3,FALSE)))","v":""},{"$f":"IF((COUNTBLANK($G24) = 1),\"\", (VLOOKUP($G24,'2. Master Adhesive List'!$A$12:$H$42,4,TRUE)))","v":""},{"$f":"IF((COUNTBLANK($G24) = 1),\"\", (VLOOKUP($G24,'2. Master Adhesive List'!$A$12:$H$62,6,TRUE)))","v":""}]
[null,{"$f":"'1. INSTRUCTIONS'!B6:J6","v":0},null,null,null,null,null,{"$f":"IF((COUNTBLANK($G25) = 1),\"\", (VLOOKUP($G25,'2. Master Adhesive List'!$A$12:$H$62,2,FALSE)))","v":""},null,null,{"$f":"IF((COUNTBLANK($G25) = 1),\"\", (VLOOKUP($G25,'2. Master Adhesive List'!$A$12:$H$62,3,FALSE)))","v":""},{"$f":"IF((COUNTBLANK($G25) = 1),\"\", (VLOOKUP($G25,'2. Master Adhesive List'!$A$12:$H$42,4,TRUE)))","v":""},{"$f":"IF((COUNTBLANK($G25) = 1),\"\", (VLOOKUP($G25,'2. Master Adhesive List'!$A$12:$H$62,6,TRUE)))","v":""}]
[null,{"$f":"'1. INSTRUCTIONS'!B6:J6","v":0},null,null,null,null,null,{"$f":"IF((COUNTBLANK($G26) = 1),\"\", (VLOOKUP($G26,'2. Master Adhesive List'!$A$12:$H$62,2,FALSE)))","v":""},null,null,{"$f":"IF((COUNTBLANK($G26) = 1),\"\", (VLOOKUP($G26,'2. Master Adhesive List'!$A$12:$H$62,3,FALSE)))","v":""},{"$f":"IF((COUNTBLANK($G26) = 1),\"\", (VLOOKUP($G26,'2. Master Adhesive List'!$A$12:$H$42,4,TRUE)))","v":""},{"$f":"IF((COUNTBLANK($G26) = 1),\"\", (VLOOKUP($G26,'2. Master Adhesive List'!$A$12:$H$62,6,TRUE)))","v":""}]
[null,{"$f":"'1. INSTRUCTIONS'!B6:J6","v":0},null,null,null,null,null,{"$f":"IF((COUNTBLANK($G27) = 1),\"\", (VLOOKUP($G27,'2. Master Adhesive List'!$A$12:$H$62,2,FALSE)))","v":""},null,null,{"$f":"IF((COUNTBLANK($G27) = 1),\"\", (VLOOKUP($G27,'2. Master Adhesive List'!$A$12:$H$62,3,FALSE)))","v":""},{"$f":"IF((COUNTBLANK($G27) = 1),\"\", (VLOOKUP($G27,'2. Master Adhesive List'!$A$12:$H$42,4,TRUE)))","v":""},{"$f":"IF((COUNTBLANK($G27) = 1),\"\", (VLOOKUP($G27,'2. Master Adhesive List'!$A$12:$H$62,6,TRUE)))","v":""},null,null,null,null,null,null,null,null,"        "]
[null,{"$f":"'1. INSTRUCTIONS'!B6:J6","v":0},null,null,null,null,null,{"$f":"IF((COUNTBLANK($G28) = 1),\"\", (VLOOKUP($G28,'2. Master Adhesive List'!$A$12:$H$62,2,FALSE)))","v":""},null,null,{"$f":"IF((COUNTBLANK($G28) = 1),\"\", (VLOOKUP($G28,'2. Master Adhesive List'!$A$12:$H$62,3,FALSE)))","v":""},{"$f":"IF((COUNTBLANK($G28) = 1),\"\", (VLOOKUP($G28,'2. Master Adhesive List'!$A$12:$H$42,4,TRUE)))","v":""},{"$f":"IF((COUNTBLANK($G28) = 1),\"\", (VLOOKUP($G28,'2. Master Adhesive List'!$A$12:$H$62,6,TRUE)))","v":""}]
[null,{"$f":"'1. INSTRUCTIONS'!B6:J6","v":0},null,null,null,null,null,{"$f":"IF((COUNTBLANK($G29) = 1),\"\", (VLOOKUP($G29,'2. Master Adhesive List'!$A$12:$H$62,2,FALSE)))","v":""},null,null,{"$f":"IF((COUNTBLANK($G29) = 1),\"\", (VLOOKUP($G29,'2. Master Adhesive List'!$A$12:$H$62,3,FALSE)))","v":""},{"$f":"IF((COUNTBLANK($G29) = 1),\"\", (VLOOKUP($G29,'2. Master Adhesive List'!$A$12:$H$42,4,TRUE)))","v":""},{"$f":"IF((COUNTBLANK($G29) = 1),\"\", (VLOOKUP($G29,'2. Master Adhesive List'!$A$12:$H$62,6,TRUE)))","v":""}]
[null,{"$f":"'1. INSTRUCTIONS'!B6:J6","v":0},null,null,null,null,null,{"$f":"IF((COUNTBLANK($G30) = 1),\"\", (VLOOKUP($G30,'2. Master Adhesive List'!$A$12:$H$62,2,FALSE)))","v":""},null,null,{"$f":"IF((COUNTBLANK($G30) = 1),\"\", (VLOOKUP($G30,'2. Master Adhesive List'!$A$12:$H$62,3,FALSE)))","v":""},{"$f":"IF((COUNTBLANK($G30) = 1),\"\", (VLOOKUP($G30,'2. Master Adhesive List'!$A$12:$H$42,4,TRUE)))","v":""},{"$f":"IF((COUNTBLANK($G30) = 1),\"\", (VLOOKUP($G30,'2. Master Adhesive List'!$A$12:$H$62,6,TRUE)))","v":""}]
[null,{"$f":"'1. INSTRUCTIONS'!B6:J6","v":0},null,null,null,null,null,{"$f":"IF((COUNTBLANK($G31) = 1),\"\", (VLOOKUP($G31,'2. Master Adhesive List'!$A$12:$H$62,2,FALSE)))","v":""},null,null,{"$f":"IF((COUNTBLANK($G31) = 1),\"\", (VLOOKUP($G31,'2. Master Adhesive List'!$A$12:$H$62,3,FALSE)))","v":""},{"$f":"IF((COUNTBLANK($G31) = 1),\"\", (VLOOKUP($G31,'2. Master Adhesive List'!$A$12:$H$42,4,TRUE)))","v":""},{"$f":"IF((COUNTBLANK($G31) = 1),\"\", (VLOOKUP($G31,'2. Master Adhesive List'!$A$12:$H$62,6,TRUE)))","v":""}]
[null,{"$f":"'1. INSTRUCTIONS'!B6:J6","v":0},null,null,null,null,null,{"$f":"IF((COUNTBLANK($G32) = 1),\"\", (VLOOKUP($G32,'2. Master Adhesive List'!$A$12:$H$62,2,FALSE)))","v":""},null,null,{"$f":"IF((COUNTBLANK($G32) = 1),\"\", (VLOOKUP($G32,'2. Master Adhesive List'!$A$12:$H$62,3,FALSE)))","v":""},{"$f":"IF((COUNTBLANK($G32) = 1),\"\", (VLOOKUP($G32,'2. Master Adhesive List'!$A$12:$H$42,4,TRUE)))","v":""},{"$f":"IF((COUNTBLANK($G32) = 1),\"\", (VLOOKUP($G32,'2. Master Adhesive List'!$A$12:$H$62,6,TRUE)))","v":""}]
[null,{"$f":"'1. INSTRUCTIONS'!B6:J6","v":0},null,null,null,null,null,{"$f":"IF((COUNTBLANK($G33) = 1),\"\", (VLOOKUP($G33,'2. Master Adhesive List'!$A$12:$H$62,2,FALSE)))","v":""},null,null,{"$f":"IF((COUNTBLANK($G33) = 1),\"\", (VLOOKUP($G33,'2. Master Adhesive List'!$A$12:$H$62,3,FALSE)))","v":""},{"$f":"IF((COUNTBLANK($G33) = 1),\"\", (VLOOKUP($G33,'2. Master Adhesive List'!$A$12:$H$42,4,TRUE)))","v":""},{"$f":"IF((COUNTBLANK($G33) = 1),\"\", (VLOOKUP($G33,'2. Master Adhesive List'!$A$12:$H$62,6,TRUE)))","v":""}]
[null,{"$f":"'1. INSTRUCTIONS'!B6:J6","v":0},null,null,null,null,null,{"$f":"IF((COUNTBLANK($G34) = 1),\"\", (VLOOKUP($G34,'2. Master Adhesive List'!$A$12:$H$62,2,FALSE)))","v":""},null,null,{"$f":"IF((COUNTBLANK($G34) = 1),\"\", (VLOOKUP($G34,'2. Master Adhesive List'!$A$12:$H$62,3,FALSE)))","v":""},{"$f":"IF((COUNTBLANK($G34) = 1),\"\", (VLOOKUP($G34,'2. Master Adhesive List'!$A$12:$H$42,4,TRUE)))","v":""},{"$f":"IF((COUNTBLANK($G34) = 1),\"\", (VLOOKUP($G34,'2. Master Adhesive List'!$A$12:$H$62,6,TRUE)))","v":""}]
[null,{"$f":"'1. INSTRUCTIONS'!B6:J6","v":0},null,null,null,null,null,{"$f":"IF((COUNTBLANK($G35) = 1),\"\", (VLOOKUP($G35,'2. Master Adhesive List'!$A$12:$H$62,2,FALSE)))","v":""},null,null,{"$f":"IF((COUNTBLANK($G35) = 1),\"\", (VLOOKUP($G35,'2. Master Adhesive List'!$A$12:$H$62,3,FALSE)))","v":""},{"$f":"IF((COUNTBLANK($G35) = 1),\"\", (VLOOKUP($G35,'2. Master Adhesive List'!$A$12:$H$42,4,TRUE)))","v":""},{"$f":"IF((COUNTBLANK($G35) = 1),\"\", (VLOOKUP($G35,'2. Master Adhesive List'!$A$12:$H$62,6,TRUE)))","v":""}]
[null,{"$f":"'1. INSTRUCTIONS'!B6:J6","v":0},null,null,null,null,null,{"$f":"IF((COUNTBLANK($G36) = 1),\"\", (VLOOKUP($G36,'2. Master Adhesive List'!$A$12:$H$62,2,FALSE)))","v":""},null,null,{"$f":"IF((COUNTBLANK($G36) = 1),\"\", (VLOOKUP($G36,'2. Master Adhesive List'!$A$12:$H$62,3,FALSE)))","v":""},{"$f":"IF((COUNTBLANK($G36) = 1),\"\", (VLOOKUP($G36,'2. Master Adhesive List'!$A$12:$H$42,4,TRUE)))","v":""},{"$f":"IF((COUNTBLANK($G36) = 1),\"\", (VLOOKUP($G36,'2. Master Adhesive List'!$A$12:$H$62,6,TRUE)))","v":""}]
[null,{"$f":"'1. INSTRUCTIONS'!B6:J6","v":0},null,null,null,null,null,{"$f":"IF((COUNTBLANK($G37) = 1),\"\", (VLOOKUP($G37,'2. Master Adhesive List'!$A$12:$H$62,2,FALSE)))","v":""},null,null,{"$f":"IF((COUNTBLANK($G37) = 1),\"\", (VLOOKUP($G37,'2. Master Adhesive List'!$A$12:$H$62,3,FALSE)))","v":""},{"$f":"IF((COUNTBLANK($G37) = 1),\"\", (VLOOKUP($G37,'2. Master Adhesive List'!$A$12:$H$42,4,TRUE)))","v":""},{"$f":"IF((COUNTBLANK($G37) = 1),\"\", (VLOOKUP($G37,'2. Master Adhesive List'!$A$12:$H$62,6,TRUE)))","v":""}]
[null,{"$f":"'1. INSTRUCTIONS'!B6:J6","v":0},null,null,null,null,null,{"$f":"IF((COUNTBLANK($G38) = 1),\"\", (VLOOKUP($G38,'2. Master Adhesive List'!$A$12:$H$62,2,FALSE)))","v":""},null,null,{"$f":"IF((COUNTBLANK($G38) = 1),\"\", (VLOOKUP($G38,'2. Master Adhesive List'!$A$12:$H$62,3,FALSE)))","v":""},{"$f":"IF((COUNTBLANK($G38) = 1),\"\", (VLOOKUP($G38,'2. Master Adhesive List'!$A$12:$H$42,4,TRUE)))","v":""},{"$f":"IF((COUNTBLANK($G38) = 1),\"\", (VLOOKUP($G38,'2. Master Adhesive List'!$A$12:$H$62,6,TRUE)))","v":""}]
[null,{"$f":"'1. INSTRUCTIONS'!B6:J6","v":0},null,null,null,null,null,{"$f":"IF((COUNTBLANK($G39) = 1),\"\", (VLOOKUP($G39,'2. Master Adhesive List'!$A$12:$H$62,2,FALSE)))","v":""},null,null,{"$f":"IF((COUNTBLANK($G39) = 1),\"\", (VLOOKUP($G39,'2. Master Adhesive List'!$A$12:$H$62,3,FALSE)))","v":""},{"$f":"IF((COUNTBLANK($G39) = 1),\"\", (VLOOKUP($G39,'2. Master Adhesive List'!$A$12:$H$42,4,TRUE)))","v":""},{"$f":"IF((COUNTBLANK($G39) = 1),\"\", (VLOOKUP($G39,'2. Master Adhesive List'!$A$12:$H$62,6,TRUE)))","v":""}]
[null,{"$f":"'1. INSTRUCTIONS'!B6:J6","v":0},null,null,null,null,null,{"$f":"IF((COUNTBLANK($G40) = 1),\"\", (VLOOKUP($G40,'2. Master Adhesive List'!$A$12:$H$62,2,FALSE)))","v":""},null,null,{"$f":"IF((COUNTBLANK($G40) = 1),\"\", (VLOOKUP($G40,'2. Master Adhesive List'!$A$12:$H$62,3,FALSE)))","v":""},{"$f":"IF((COUNTBLANK($G40) = 1),\"\", (VLOOKUP($G40,'2. Master Adhesive List'!$A$12:$H$42,4,TRUE)))","v":""},{"$f":"IF((COUNTBLANK($G40) = 1),\"\", (VLOOKUP($G40,'2. Master Adhesive List'!$A$12:$H$62,6,TRUE)))","v":""}]
[null,{"$f":"'1. INSTRUCTIONS'!B6:J6","v":0},null,null,null,null,null,{"$f":"IF((COUNTBLANK($G41) = 1),\"\", (VLOOKUP($G41,'2. Master Adhesive List'!$A$12:$H$62,2,FALSE)))","v":""},null,null,{"$f":"IF((COUNTBLANK($G41) = 1),\"\", (VLOOKUP($G41,'2. Master Adhesive List'!$A$12:$H$62,3,FALSE)))","v":""},{"$f":"IF((COUNTBLANK($G41) = 1),\"\", (VLOOKUP($G41,'2. Master Adhesive List'!$A$12:$H$42,4,TRUE)))","v":""},{"$f":"IF((COUNTBLANK($G41) = 1),\"\", (VLOOKUP($G41,'2. Master Adhesive List'!$A$12:$H$62,6,TRUE)))","v":""}]
[null,{"$f":"'1. INSTRUCTIONS'!B6:J6","v":0},null,null,null,null,null,{"$f":"IF((COUNTBLANK($G42) = 1),\"\", (VLOOKUP($G42,'2. Master Adhesive List'!$A$12:$H$62,2,FALSE)))","v":""},null,null,{"$f":"IF((COUNTBLANK($G42) = 1),\"\", (VLOOKUP($G42,'2. Master Adhesive List'!$A$12:$H$62,3,FALSE)))","v":""},{"$f":"IF((COUNTBLANK($G42) = 1),\"\", (VLOOKUP($G42,'2. Master Adhesive List'!$A$12:$H$42,4,TRUE)))","v":""},{"$f":"IF((COUNTBLANK($G42) = 1),\"\", (VLOOKUP($G42,'2. Master Adhesive List'!$A$12:$H$62,6,TRUE)))","v":""}]
[null,{"$f":"'1. INSTRUCTIONS'!B6:J6","v":0},null,null,null,null,null,{"$f":"IF((COUNTBLANK($G43) = 1),\"\", (VLOOKUP($G43,'2. Master Adhesive List'!$A$12:$H$62,2,FALSE)))","v":""},null,null,{"$f":"IF((COUNTBLANK($G43) = 1),\"\", (VLOOKUP($G43,'2. Master Adhesive List'!$A$12:$H$62,3,FALSE)))","v":""},{"$f":"IF((COUNTBLANK($G43) = 1),\"\", (VLOOKUP($G43,'2. Master Adhesive List'!$A$12:$H$42,4,TRUE)))","v":""},{"$f":"IF((COUNTBLANK($G43) = 1),\"\", (VLOOKUP($G43,'2. Master Adhesive List'!$A$12:$H$62,6,TRUE)))","v":""}]
[null,{"$f":"'1. INSTRUCTIONS'!B6:J6","v":0},null,null,null,null,null,{"$f":"IF((COUNTBLANK($G44) = 1),\"\", (VLOOKUP($G44,'2. Master Adhesive List'!$A$12:$H$62,2,FALSE)))","v":""},null,null,{"$f":"IF((COUNTBLANK($G44) = 1),\"\", (VLOOKUP($G44,'2. Master Adhesive List'!$A$12:$H$62,3,FALSE)))","v":""},{"$f":"IF((COUNTBLANK($G44) = 1),\"\", (VLOOKUP($G44,'2. Master Adhesive List'!$A$12:$H$42,4,TRUE)))","v":""},{"$f":"IF((COUNTBLANK($G44) = 1),\"\", (VLOOKUP($G44,'2. Master Adhesive List'!$A$12:$H$62,6,TRUE)))","v":""}]
[null,{"$f":"'1. INSTRUCTIONS'!B6:J6","v":0},null,null,null,null,null,{"$f":"IF((COUNTBLANK($G45) = 1),\"\", (VLOOKUP($G45,'2. Master Adhesive List'!$A$12:$H$62,2,FALSE)))","v":""},null,null,{"$f":"IF((COUNTBLANK($G45) = 1),\"\", (VLOOKUP($G45,'2. Master Adhesive List'!$A$12:$H$62,3,FALSE)))","v":""},{"$f":"IF((COUNTBLANK($G45) = 1),\"\", (VLOOKUP($G45,'2. Master Adhesive List'!$A$12:$H$42,4,TRUE)))","v":""},{"$f":"IF((COUNTBLANK($G45) = 1),\"\", (VLOOKUP($G45,'2. Master Adhesive List'!$A$12:$H$62,6,TRUE)))","v":""}]
[null,{"$f":"'1. INSTRUCTIONS'!B6:J6","v":0},null,null,null,null,null,{"$f":"IF((COUNTBLANK($G46) = 1),\"\", (VLOOKUP($G46,'2. Master Adhesive List'!$A$12:$H$62,2,FALSE)))","v":""},null,null,{"$f":"IF((COUNTBLANK($G46) = 1),\"\", (VLOOKUP($G46,'2. Master Adhesive List'!$A$12:$H$62,3,FALSE)))","v":""},{"$f":"IF((COUNTBLANK($G46) = 1),\"\", (VLOOKUP($G46,'2. Master Adhesive List'!$A$12:$H$42,4,TRUE)))","v":""},{"$f":"IF((COUNTBLANK($G46) = 1),\"\", (VLOOKUP($G46,'2. Master Adhesive List'!$A$12:$H$62,6,TRUE)))","v":""}]
[null,{"$f":"'1. INSTRUCTIONS'!B6:J6","v":0},null,null,null,null,null,{"$f":"IF((COUNTBLANK($G47) = 1),\"\", (VLOOKUP($G47,'2. Master Adhesive List'!$A$12:$H$62,2,FALSE)))","v":""},null,null,{"$f":"IF((COUNTBLANK($G47) = 1),\"\", (VLOOKUP($G47,'2. Master Adhesive List'!$A$12:$H$62,3,FALSE)))","v":""},{"$f":"IF((COUNTBLANK($G47) = 1),\"\", (VLOOKUP($G47,'2. Master Adhesive List'!$A$12:$H$42,4,TRUE)))","v":""},{"$f":"IF((COUNTBLANK($G47) = 1),\"\", (VLOOKUP($G47,'2. Master Adhesive List'!$A$12:$H$62,6,TRUE)))","v":""}]
[null,{"$f":"'1. INSTRUCTIONS'!B6:J6","v":0},null,null,null,null,null,{"$f":"IF((COUNTBLANK($G48) = 1),\"\", (VLOOKUP($G48,'2. Master Adhesive List'!$A$12:$H$62,2,FALSE)))","v":""},null,null,{"$f":"IF((COUNTBLANK($G48) = 1),\"\", (VLOOKUP($G48,'2. Master Adhesive List'!$A$12:$H$62,3,FALSE)))","v":""},{"$f":"IF((COUNTBLANK($G48) = 1),\"\", (VLOOKUP($G48,'2. Master Adhesive List'!$A$12:$H$42,4,TRUE)))","v":""},{"$f":"IF((COUNTBLANK($G48) = 1),\"\", (VLOOKUP($G48,'2. Master Adhesive List'!$A$12:$H$62,6,TRUE)))","v":""}]
[null,{"$f":"'1. INSTRUCTIONS'!B6:J6","v":0},null,null,null,null,null,{"$f":"IF((COUNTBLANK($G49) = 1),\"\", (VLOOKUP($G49,'2. Master Adhesive List'!$A$12:$H$62,2,FALSE)))","v":""},null,null,{"$f":"IF((COUNTBLANK($G49) = 1),\"\", (VLOOKUP($G49,'2. Master Adhesive List'!$A$12:$H$62,3,FALSE)))","v":""},{"$f":"IF((COUNTBLANK($G49) = 1),\"\", (VLOOKUP($G49,'2. Master Adhesive List'!$A$12:$H$42,4,TRUE)))","v":""},{"$f":"IF((COUNTBLANK($G49) = 1),\"\", (VLOOKUP($G49,'2. Master Adhesive List'!$A$12:$H$62,6,TRUE)))","v":""}]
[null,{"$f":"'1. INSTRUCTIONS'!B6:J6","v":0},null,null,null,null,null,{"$f":"IF((COUNTBLANK($G50) = 1),\"\", (VLOOKUP($G50,'2. Master Adhesive List'!$A$12:$H$62,2,FALSE)))","v":""},null,null,{"$f":"IF((COUNTBLANK($G50) = 1),\"\", (VLOOKUP($G50,'2. Master Adhesive List'!$A$12:$H$62,3,FALSE)))","v":""},{"$f":"IF((COUNTBLANK($G50) = 1),\"\", (VLOOKUP($G50,'2. Master Adhesive List'!$A$12:$H$42,4,TRUE)))","v":""},{"$f":"IF((COUNTBLANK($G50) = 1),\"\", (VLOOKUP($G50,'2. Master Adhesive List'!$A$12:$H$62,6,TRUE)))","v":""}]
[null,{"$f":"'1. INSTRUCTIONS'!B6:J6","v":0},null,null,null,null,null,{"$f":"IF((COUNTBLANK($G51) = 1),\"\", (VLOOKUP($G51,'2. Master Adhesive List'!$A$12:$H$62,2,FALSE)))","v":""},null,null,{"$f":"IF((COUNTBLANK($G51) = 1),\"\", (VLOOKUP($G51,'2. Master Adhesive List'!$A$12:$H$62,3,FALSE)))","v":""},{"$f":"IF((COUNTBLANK($G51) = 1),\"\", (VLOOKUP($G51,'2. Master Adhesive List'!$A$12:$H$42,4,TRUE)))","v":""},{"$f":"IF((COUNTBLANK($G51) = 1),\"\", (VLOOKUP($G51,'2. Master Adhesive List'!$A$12:$H$62,6,TRUE)))","v":""}]
[null,{"$f":"'1. INSTRUCTIONS'!B6:J6","v":0},null,null,null,null,null,{"$f":"IF((COUNTBLANK($G52) = 1),\"\", (VLOOKUP($G52,'2. Master Adhesive List'!$A$12:$H$62,2,FALSE)))","v":""},null,null,{"$f":"IF((COUNTBLANK($G52) = 1),\"\", (VLOOKUP($G52,'2. Master Adhesive List'!$A$12:$H$62,3,FALSE)))","v":""},{"$f":"IF((COUNTBLANK($G52) = 1),\"\", (VLOOKUP($G52,'2. Master Adhesive List'!$A$12:$H$42,4,TRUE)))","v":""},{"$f":"IF((COUNTBLANK($G52) = 1),\"\", (VLOOKUP($G52,'2. Master Adhesive List'!$A$12:$H$62,6,TRUE)))","v":""}]
[null,{"$f":"'1. INSTRUCTIONS'!B6:J6","v":0},null,null,null,null,null,{"$f":"IF((COUNTBLANK($G53) = 1),\"\", (VLOOKUP($G53,'2. Master Adhesive List'!$A$12:$H$62,2,FALSE)))","v":""},null,null,{"$f":"IF((COUNTBLANK($G53) = 1),\"\", (VLOOKUP($G53,'2. Master Adhesive List'!$A$12:$H$62,3,FALSE)))","v":""},{"$f":"IF((COUNTBLANK($G53) = 1),\"\", (VLOOKUP($G53,'2. Master Adhesive List'!$A$12:$H$42,4,TRUE)))","v":""},{"$f":"IF((COUNTBLANK($G53) = 1),\"\", (VLOOKUP($G53,'2. Master Adhesive List'!$A$12:$H$62,6,TRUE)))","v":""}]
[null,{"$f":"'1. INSTRUCTIONS'!B6:J6","v":0},null,null,null,null,null,{"$f":"IF((COUNTBLANK($G54) = 1),\"\", (VLOOKUP($G54,'2. Master Adhesive List'!$A$12:$H$62,2,FALSE)))","v":""},null,null,{"$f":"IF((COUNTBLANK($G54) = 1),\"\", (VLOOKUP($G54,'2. Master Adhesive List'!$A$12:$H$62,3,FALSE)))","v":""},{"$f":"IF((COUNTBLANK($G54) = 1),\"\", (VLOOKUP($G54,'2. Master Adhesive List'!$A$12:$H$42,4,TRUE)))","v":""},{"$f":"IF((COUNTBLANK($G54) = 1),\"\", (VLOOKUP($G54,'2. Master Adhesive List'!$A$12:$H$62,6,TRUE)))","v":""}]
[null,{"$f":"'1. INSTRUCTIONS'!B6:J6","v":0},null,null,null,null,null,{"$f":"IF((COUNTBLANK($G55) = 1),\"\", (VLOOKUP($G55,'2. Master Adhesive List'!$A$12:$H$62,2,FALSE)))","v":""},null,null,{"$f":"IF((COUNTBLANK($G55) = 1),\"\", (VLOOKUP($G55,'2. Master Adhesive List'!$A$12:$H$62,3,FALSE)))","v":""},{"$f":"IF((COUNTBLANK($G55) = 1),\"\", (VLOOKUP($G55,'2. Master Adhesive List'!$A$12:$H$42,4,TRUE)))","v":""},{"$f":"IF((COUNTBLANK($G55) = 1),\"\", (VLOOKUP($G55,'2. Master Adhesive List'!$A$12:$H$62,6,TRUE)))","v":""}]
[null,{"$f":"'1. INSTRUCTIONS'!B6:J6","v":0},null,null,null,null,null,{"$f":"IF((COUNTBLANK($G56) = 1),\"\", (VLOOKUP($G56,'2. Master Adhesive List'!$A$12:$H$62,2,FALSE)))","v":""},null,null,{"$f":"IF((COUNTBLANK($G56) = 1),\"\", (VLOOKUP($G56,'2. Master Adhesive List'!$A$12:$H$62,3,FALSE)))","v":""},{"$f":"IF((COUNTBLANK($G56) = 1),\"\", (VLOOKUP($G56,'2. Master Adhesive List'!$A$12:$H$42,4,TRUE)))","v":""},{"$f":"IF((COUNTBLANK($G56) = 1),\"\", (VLOOKUP($G56,'2. Master Adhesive List'!$A$12:$H$62,6,TRUE)))","v":""}]
[null,{"$f":"'1. INSTRUCTIONS'!B6:J6","v":0},null,null,null,null,null,{"$f":"IF((COUNTBLANK($G57) = 1),\"\", (VLOOKUP($G57,'2. Master Adhesive List'!$A$12:$H$62,2,FALSE)))","v":""},null,null,{"$f":"IF((COUNTBLANK($G57) = 1),\"\", (VLOOKUP($G57,'2. Master Adhesive List'!$A$12:$H$62,3,FALSE)))","v":""},{"$f":"IF((COUNTBLANK($G57) = 1),\"\", (VLOOKUP($G57,'2. Master Adhesive List'!$A$12:$H$42,4,TRUE)))","v":""},{"$f":"IF((COUNTBLANK($G57) = 1),\"\", (VLOOKUP($G57,'2. Master Adhesive List'!$A$12:$H$62,6,TRUE)))","v":""}]
[null,{"$f":"'1. INSTRUCTIONS'!B6:J6","v":0},null,null,null,null,null,{"$f":"IF((COUNTBLANK($G58) = 1),\"\", (VLOOKUP($G58,'2. Master Adhesive List'!$A$12:$H$62,2,FALSE)))","v":""},null,null,{"$f":"IF((COUNTBLANK($G58) = 1),\"\", (VLOOKUP($G58,'2. Master Adhesive List'!$A$12:$H$62,3,FALSE)))","v":""},{"$f":"IF((COUNTBLANK($G58) = 1),\"\", (VLOOKUP($G58,'2. Master Adhesive List'!$A$12:$H$42,4,TRUE)))","v":""},{"$f":"IF((COUNTBLANK($G58) = 1),\"\", (VLOOKUP($G58,'2. Master Adhesive List'!$A$12:$H$62,6,TRUE)))","v":""}]
[null,{"$f":"'1. INSTRUCTIONS'!B6:J6","v":0},null,null,null,null,null,{"$f":"IF((COUNTBLANK($G59) = 1),\"\", (VLOOKUP($G59,'2. Master Adhesive List'!$A$12:$H$62,2,FALSE)))","v":""},null,null,{"$f":"IF((COUNTBLANK($G59) = 1),\"\", (VLOOKUP($G59,'2. Master Adhesive List'!$A$12:$H$62,3,FALSE)))","v":""},{"$f":"IF((COUNTBLANK($G59) = 1),\"\", (VLOOKUP($G59,'2. Master Adhesive List'!$A$12:$H$42,4,TRUE)))","v":""},{"$f":"IF((COUNTBLANK($G59) = 1),\"\", (VLOOKUP($G59,'2. Master Adhesive List'!$A$12:$H$62,6,TRUE)))","v":""}]
[null,{"$f":"'1. INSTRUCTIONS'!B6:J6","v":0},null,null,null,null,null,{"$f":"IF((COUNTBLANK($G60) = 1),\"\", (VLOOKUP($G60,'2. Master Adhesive List'!$A$12:$H$62,2,FALSE)))","v":""},null,null,{"$f":"IF((COUNTBLANK($G60) = 1),\"\", (VLOOKUP($G60,'2. Master Adhesive List'!$A$12:$H$62,3,FALSE)))","v":""},{"$f":"IF((COUNTBLANK($G60) = 1),\"\", (VLOOKUP($G60,'2. Master Adhesive List'!$A$12:$H$42,4,TRUE)))","v":""},{"$f":"IF((COUNTBLANK($G60) = 1),\"\", (VLOOKUP($G60,'2. Master Adhesive List'!$A$12:$H$62,6,TRUE)))","v":""}]
[null,{"$f":"'1. INSTRUCTIONS'!B6:J6","v":0},null,null,null,null,null,{"$f":"IF((COUNTBLANK($G61) = 1),\"\", (VLOOKUP($G61,'2. Master Adhesive List'!$A$12:$H$62,2,FALSE)))","v":""},null,null,{"$f":"IF((COUNTBLANK($G61) = 1),\"\", (VLOOKUP($G61,'2. Master Adhesive List'!$A$12:$H$62,3,FALSE)))","v":""},{"$f":"IF((COUNTBLANK($G61) = 1),\"\", (VLOOKUP($G61,'2. Master Adhesive List'!$A$12:$H$42,4,TRUE)))","v":""},{"$f":"IF((COUNTBLANK($G61) = 1),\"\", (VLOOKUP($G61,'2. Master Adhesive List'!$A$12:$H$62,6,TRUE)))","v":""}]
[null,{"$f":"'1. INSTRUCTIONS'!B6:J6","v":0},null,null,null,null,null,{"$f":"IF((COUNTBLANK($G62) = 1),\"\", (VLOOKUP($G62,'2. Master Adhesive List'!$A$12:$H$62,2,FALSE)))","v":""},null,null,{"$f":"IF((COUNTBLANK($G62) = 1),\"\", (VLOOKUP($G62,'2. Master Adhesive List'!$A$12:$H$62,3,FALSE)))","v":""},{"$f":"IF((COUNTBLANK($G62) = 1),\"\", (VLOOKUP($G62,'2. Master Adhesive List'!$A$12:$H$42,4,TRUE)))","v":""},{"$f":"IF((COUNTBLANK($G62) = 1),\"\", (VLOOKUP($G62,'2. Master Adhesive List'!$A$12:$H$62,6,TRUE)))","v":""}]
[null,{"$f":"'1. INSTRUCTIONS'!B6:J6","v":0},null,null,null,null,null,{"$f":"IF((COUNTBLANK($G63) = 1),\"\", (VLOOKUP($G63,'2. Master Adhesive List'!$A$12:$H$62,2,FALSE)))","v":""},null,null,{"$f":"IF((COUNTBLANK($G63) = 1),\"\", (VLOOKUP($G63,'2. Master Adhesive List'!$A$12:$H$62,3,FALSE)))","v":""},{"$f":"IF((COUNTBLANK($G63) = 1),\"\", (VLOOKUP($G63,'2. Master Adhesive List'!$A$12:$H$42,4,TRUE)))","v":""},{"$f":"IF((COUNTBLANK($G63) = 1),\"\", (VLOOKUP($G63,'2. Master Adhesive List'!$A$12:$H$62,6,TRUE)))","v":""}]
[null,{"$f":"'1. INSTRUCTIONS'!B6:J6","v":0},null,null,null,null,null,{"$f":"IF((COUNTBLANK($G64) = 1),\"\", (VLOOKUP($G64,'2. Master Adhesive List'!$A$12:$H$62,2,FALSE)))","v":""},null,null,{"$f":"IF((COUNTBLANK($G64) = 1),\"\", (VLOOKUP($G64,'2. Master Adhesive List'!$A$12:$H$62,3,FALSE)))","v":""},{"$f":"IF((COUNTBLANK($G64) = 1),\"\", (VLOOKUP($G64,'2. Master Adhesive List'!$A$12:$H$42,4,TRUE)))","v":""},{"$f":"IF((COUNTBLANK($G64) = 1),\"\", (VLOOKUP($G64,'2. Master Adhesive List'!$A$12:$H$62,6,TRUE)))","v":""}]
[null,{"$f":"'1. INSTRUCTIONS'!B6:J6","v":0},null,null,null,null,null,{"$f":"IF((COUNTBLANK($G65) = 1),\"\", (VLOOKUP($G65,'2. Master Adhesive List'!$A$12:$H$62,2,FALSE)))","v":""},null,null,{"$f":"IF((COUNTBLANK($G65) = 1),\"\", (VLOOKUP($G65,'2. Master Adhesive List'!$A$12:$H$62,3,FALSE)))","v":""},{"$f":"IF((COUNTBLANK($G65) = 1),\"\", (VLOOKUP($G65,'2. Master Adhesive List'!$A$12:$H$42,4,TRUE)))","v":""},{"$f":"IF((COUNTBLANK($G65) = 1),\"\", (VLOOKUP($G65,'2. Master Adhesive List'!$A$12:$H$62,6,TRUE)))","v":""}]
[null,{"$f":"'1. INSTRUCTIONS'!B6:J6","v":0},null,null,null,null,null,{"$f":"IF((COUNTBLANK($G66) = 1),\"\", (VLOOKUP($G66,'2. Master Adhesive List'!$A$12:$H$62,2,FALSE)))","v":""},null,null,{"$f":"IF((COUNTBLANK($G66) = 1),\"\", (VLOOKUP($G66,'2. Master Adhesive List'!$A$12:$H$62,3,FALSE)))","v":""},{"$f":"IF((COUNTBLANK($G66) = 1),\"\", (VLOOKUP($G66,'2. Master Adhesive List'!$A$12:$H$42,4,TRUE)))","v":""},{"$f":"IF((COUNTBLANK($G66) = 1),\"\", (VLOOKUP($G66,'2. Master Adhesive List'!$A$12:$H$62,6,TRUE)))","v":""}]
[null,{"$f":"'1. INSTRUCTIONS'!B6:J6","v":0},null,null,null,null,null,{"$f":"IF((COUNTBLANK($G67) = 1),\"\", (VLOOKUP($G67,'2. Master Adhesive List'!$A$12:$H$62,2,FALSE)))","v":""},null,null,{"$f":"IF((COUNTBLANK($G67) = 1),\"\", (VLOOKUP($G67,'2. Master Adhesive List'!$A$12:$H$62,3,FALSE)))","v":""},{"$f":"IF((COUNTBLANK($G67) = 1),\"\", (VLOOKUP($G67,'2. Master Adhesive List'!$A$12:$H$42,4,TRUE)))","v":""},{"$f":"IF((COUNTBLANK($G67) = 1),\"\", (VLOOKUP($G67,'2. Master Adhesive List'!$A$12:$H$62,6,TRUE)))","v":""}]
[null,{"$f":"'1. INSTRUCTIONS'!B6:J6","v":0},null,null,null,null,null,{"$f":"IF((COUNTBLANK($G68) = 1),\"\", (VLOOKUP($G68,'2. Master Adhesive List'!$A$12:$H$62,2,FALSE)))","v":""},null,null,{"$f":"IF((COUNTBLANK($G68) = 1),\"\", (VLOOKUP($G68,'2. Master Adhesive List'!$A$12:$H$62,3,FALSE)))","v":""},{"$f":"IF((COUNTBLANK($G68) = 1),\"\", (VLOOKUP($G68,'2. Master Adhesive List'!$A$12:$H$42,4,TRUE)))","v":""},{"$f":"IF((COUNTBLANK($G68) = 1),\"\", (VLOOKUP($G68,'2. Master Adhesive List'!$A$12:$H$62,6,TRUE)))","v":""}]
[null,{"$f":"'1. INSTRUCTIONS'!B6:J6","v":0},null,null,null,null,null,{"$f":"IF((COUNTBLANK($G69) = 1),\"\", (VLOOKUP($G69,'2. Master Adhesive List'!$A$12:$H$62,2,FALSE)))","v":""},null,null,{"$f":"IF((COUNTBLANK($G69) = 1),\"\", (VLOOKUP($G69,'2. Master Adhesive List'!$A$12:$H$62,3,FALSE)))","v":""},{"$f":"IF((COUNTBLANK($G69) = 1),\"\", (VLOOKUP($G69,'2. Master Adhesive List'!$A$12:$H$42,4,TRUE)))","v":""},{"$f":"IF((COUNTBLANK($G69) = 1),\"\", (VLOOKUP($G69,'2. Master Adhesive List'!$A$12:$H$62,6,TRUE)))","v":""}]
[null,{"$f":"'1. INSTRUCTIONS'!B6:J6","v":0},null,null,null,null,null,{"$f":"IF((COUNTBLANK($G70) = 1),\"\", (VLOOKUP($G70,'2. Master Adhesive List'!$A$12:$H$62,2,FALSE)))","v":""},null,null,{"$f":"IF((COUNTBLANK($G70) = 1),\"\", (VLOOKUP($G70,'2. Master Adhesive List'!$A$12:$H$62,3,FALSE)))","v":""},{"$f":"IF((COUNTBLANK($G70) = 1),\"\", (VLOOKUP($G70,'2. Master Adhesive List'!$A$12:$H$42,4,TRUE)))","v":""},{"$f":"IF((COUNTBLANK($G70) = 1),\"\", (VLOOKUP($G70,'2. Master Adhesive List'!$A$12:$H$62,6,TRUE)))","v":""}]
[null,{"$f":"'1. INSTRUCTIONS'!B6:J6","v":0},null,null,null,null,null,{"$f":"IF((COUNTBLANK($G71) = 1),\"\", (VLOOKUP($G71,'2. Master Adhesive List'!$A$12:$H$62,2,FALSE)))","v":""},null,null,{"$f":"IF((COUNTBLANK($G71) = 1),\"\", (VLOOKUP($G71,'2. Master Adhesive List'!$A$12:$H$62,3,FALSE)))","v":""},{"$f":"IF((COUNTBLANK($G71) = 1),\"\", (VLOOKUP($G71,'2. Master Adhesive List'!$A$12:$H$42,4,TRUE)))","v":""},{"$f":"IF((COUNTBLANK($G71) = 1),\"\", (VLOOKUP($G71,'2. Master Adhesive List'!$A$12:$H$62,6,TRUE)))","v":""}]
[null,{"$f":"'1. INSTRUCTIONS'!B6:J6","v":0},null,null,null,null,null,{"$f":"IF((COUNTBLANK($G72) = 1),\"\", (VLOOKUP($G72,'2. Master Adhesive List'!$A$12:$H$62,2,FALSE)))","v":""},null,null,{"$f":"IF((COUNTBLANK($G72) = 1),\"\", (VLOOKUP($G72,'2. Master Adhesive List'!$A$12:$H$62,3,FALSE)))","v":""},{"$f":"IF((COUNTBLANK($G72) = 1),\"\", (VLOOKUP($G72,'2. Master Adhesive List'!$A$12:$H$42,4,TRUE)))","v":""},{"$f":"IF((COUNTBLANK($G72) = 1),\"\", (VLOOKUP($G72,'2. Master Adhesive List'!$A$12:$H$62,6,TRUE)))","v":""}]
[null,{"$f":"'1. INSTRUCTIONS'!B6:J6","v":0},null,null,null,null,null,{"$f":"IF((COUNTBLANK($G73) = 1),\"\", (VLOOKUP($G73,'2. Master Adhesive List'!$A$12:$H$62,2,FALSE)))","v":""},null,null,{"$f":"IF((COUNTBLANK($G73) = 1),\"\", (VLOOKUP($G73,'2. Master Adhesive List'!$A$12:$H$62,3,FALSE)))","v":""},{"$f":"IF((COUNTBLANK($G73) = 1),\"\", (VLOOKUP($G73,'2. Master Adhesive List'!$A$12:$H$42,4,TRUE)))","v":""},{"$f":"IF((COUNTBLANK($G73) = 1),\"\", (VLOOKUP($G73,'2. Master Adhesive List'!$A$12:$H$62,6,TRUE)))","v":""}]
[null,{"$f":"'1. INSTRUCTIONS'!B6:J6","v":0},null,null,null,null,null,{"$f":"IF((COUNTBLANK($G74) = 1),\"\", (VLOOKUP($G74,'2. Master Adhesive List'!$A$12:$H$62,2,FALSE)))","v":""},null,null,{"$f":"IF((COUNTBLANK($G74) = 1),\"\", (VLOOKUP($G74,'2. Master Adhesive List'!$A$12:$H$62,3,FALSE)))","v":""},{"$f":"IF((COUNTBLANK($G74) = 1),\"\", (VLOOKUP($G74,'2. Master Adhesive List'!$A$12:$H$42,4,TRUE)))","v":""},{"$f":"IF((COUNTBLANK($G74) = 1),\"\", (VLOOKUP($G74,'2. Master Adhesive List'!$A$12:$H$62,6,TRUE)))","v":""}]
[null,{"$f":"'1. INSTRUCTIONS'!B6:J6","v":0},null,null,null,null,null,{"$f":"IF((COUNTBLANK($G75) = 1),\"\", (VLOOKUP($G75,'2. Master Adhesive List'!$A$12:$H$62,2,FALSE)))","v":""},null,null,{"$f":"IF((COUNTBLANK($G75) = 1),\"\", (VLOOKUP($G75,'2. Master Adhesive List'!$A$12:$H$62,3,FALSE)))","v":""},{"$f":"IF((COUNTBLANK($G75) = 1),\"\", (VLOOKUP($G75,'2. Master Adhesive List'!$A$12:$H$42,4,TRUE)))","v":""},{"$f":"IF((COUNTBLANK($G75) = 1),\"\", (VLOOKUP($G75,'2. Master Adhesive List'!$A$12:$H$62,6,TRUE)))","v":""}]
[null,{"$f":"'1. INSTRUCTIONS'!B6:J6","v":0},null,null,null,null,null,{"$f":"IF((COUNTBLANK($G76) = 1),\"\", (VLOOKUP($G76,'2. Master Adhesive List'!$A$12:$H$62,2,FALSE)))","v":""},null,null,{"$f":"IF((COUNTBLANK($G76) = 1),\"\", (VLOOKUP($G76,'2. Master Adhesive List'!$A$12:$H$62,3,FALSE)))","v":""},{"$f":"IF((COUNTBLANK($G76) = 1),\"\", (VLOOKUP($G76,'2. Master Adhesive List'!$A$12:$H$42,4,TRUE)))","v":""},{"$f":"IF((COUNTBLANK($G76) = 1),\"\", (VLOOKUP($G76,'2. Master Adhesive List'!$A$12:$H$62,6,TRUE)))","v":""}]
[null,{"$f":"'1. INSTRUCTIONS'!B6:J6","v":0},null,null,null,null,null,{"$f":"IF((COUNTBLANK($G77) = 1),\"\", (VLOOKUP($G77,'2. Master Adhesive List'!$A$12:$H$62,2,FALSE)))","v":""},null,null,{"$f":"IF((COUNTBLANK($G77) = 1),\"\", (VLOOKUP($G77,'2. Master Adhesive List'!$A$12:$H$62,3,FALSE)))","v":""},{"$f":"IF((COUNTBLANK($G77) = 1),\"\", (VLOOKUP($G77,'2. Master Adhesive List'!$A$12:$H$42,4,TRUE)))","v":""},{"$f":"IF((COUNTBLANK($G77) = 1),\"\", (VLOOKUP($G77,'2. Master Adhesive List'!$A$12:$H$62,6,TRUE)))","v":""}]
[null,{"$f":"'1. INSTRUCTIONS'!B6:J6","v":0},null,null,null,null,null,{"$f":"IF((COUNTBLANK($G78) = 1),\"\", (VLOOKUP($G78,'2. Master Adhesive List'!$A$12:$H$62,2,FALSE)))","v":""},null,null,{"$f":"IF((COUNTBLANK($G78) = 1),\"\", (VLOOKUP($G78,'2. Master Adhesive List'!$A$12:$H$62,3,FALSE)))","v":""},{"$f":"IF((COUNTBLANK($G78) = 1),\"\", (VLOOKUP($G78,'2. Master Adhesive List'!$A$12:$H$42,4,TRUE)))","v":""},{"$f":"IF((COUNTBLANK($G78) = 1),\"\", (VLOOKUP($G78,'2. Master Adhesive List'!$A$12:$H$62,6,TRUE)))","v":""}]
[null,{"$f":"'1. INSTRUCTIONS'!B6:J6","v":0},null,null,null,null,null,{"$f":"IF((COUNTBLANK($G79) = 1),\"\", (VLOOKUP($G79,'2. Master Adhesive List'!$A$12:$H$62,2,FALSE)))","v":""},null,null,{"$f":"IF((COUNTBLANK($G79) = 1),\"\", (VLOOKUP($G79,'2. Master Adhesive List'!$A$12:$H$62,3,FALSE)))","v":""},{"$f":"IF((COUNTBLANK($G79) = 1),\"\", (VLOOKUP($G79,'2. Master Adhesive List'!$A$12:$H$42,4,TRUE)))","v":""},{"$f":"IF((COUNTBLANK($G79) = 1),\"\", (VLOOKUP($G79,'2. Master Adhesive List'!$A$12:$H$62,6,TRUE)))","v":""}]
[null,{"$f":"'1. INSTRUCTIONS'!B6:J6","v":0},null,null,null,null,null,{"$f":"IF((COUNTBLANK($G80) = 1),\"\", (VLOOKUP($G80,'2. Master Adhesive List'!$A$12:$H$62,2,FALSE)))","v":""},null,null,{"$f":"IF((COUNTBLANK($G80) = 1),\"\", (VLOOKUP($G80,'2. Master Adhesive List'!$A$12:$H$62,3,FALSE)))","v":""},{"$f":"IF((COUNTBLANK($G80) = 1),\"\", (VLOOKUP($G80,'2. Master Adhesive List'!$A$12:$H$42,4,TRUE)))","v":""},{"$f":"IF((COUNTBLANK($G80) = 1),\"\", (VLOOKUP($G80,'2. Master Adhesive List'!$A$12:$H$62,6,TRUE)))","v":""}]
[null,{"$f":"'1. INSTRUCTIONS'!B6:J6","v":0},null,null,null,null,null,{"$f":"IF((COUNTBLANK($G81) = 1),\"\", (VLOOKUP($G81,'2. Master Adhesive List'!$A$12:$H$62,2,FALSE)))","v":""},null,null,{"$f":"IF((COUNTBLANK($G81) = 1),\"\", (VLOOKUP($G81,'2. Master Adhesive List'!$A$12:$H$62,3,FALSE)))","v":""},{"$f":"IF((COUNTBLANK($G81) = 1),\"\", (VLOOKUP($G81,'2. Master Adhesive List'!$A$12:$H$42,4,TRUE)))","v":""},{"$f":"IF((COUNTBLANK($G81) = 1),\"\", (VLOOKUP($G81,'2. Master Adhesive List'!$A$12:$H$62,6,TRUE)))","v":""}]
[null,{"$f":"'1. INSTRUCTIONS'!B6:J6","v":0},null,null,null,null,null,{"$f":"IF((COUNTBLANK($G82) = 1),\"\", (VLOOKUP($G82,'2. Master Adhesive List'!$A$12:$H$62,2,FALSE)))","v":""},null,null,{"$f":"IF((COUNTBLANK($G82) = 1),\"\", (VLOOKUP($G82,'2. Master Adhesive List'!$A$12:$H$62,3,FALSE)))","v":""},{"$f":"IF((COUNTBLANK($G82) = 1),\"\", (VLOOKUP($G82,'2. Master Adhesive List'!$A$12:$H$42,4,TRUE)))","v":""},{"$f":"IF((COUNTBLANK($G82) = 1),\"\", (VLOOKUP($G82,'2. Master Adhesive List'!$A$12:$H$62,6,TRUE)))","v":""}]

{"sheet":"5. Solvent Reprting Form","index":4,"n_rows":87,"n_cols":17,"rows_kept":87,"cut":false,"hidden":false,"merged":[[83,9,83,12],[0,4,1,5],[7,4,9,11],[11,5,11,6],[11,9,11,11]]}
[null,null,null,null,"Name of Company Perfoming Marine Coating:",null,"Company Name"]
[null,null,null,null,null,null,{"$f":"'1. INSTRUCTIONS'!B6","v":0},null,"Reporting Month:",null,null,"Reporting Year:"]
[]
[]
[]
[]
[null,null,null,null,"Report Certification:"]
[null,null,null,null,"I certify that this report contains an accurate and complete accounting of all marine coating activities performed by the above-listed company at the listed government installation during the reporting month.  I further certify that the company listed above employs a system to verify the as-supplied VOC content of each batch of coating  used to ensure that the VOC content does not exceed the VOC limits established in San Diego Air Pollution Control District Rule 67.18 (and 40 CFR Part 63, where applicable).  I certify that no paint products were thinned and that the values shown above are an accurate representation of the as-applied VOC content of the products used. "]
[]
[]
[]
[null,null,null,null,"Name:",null,null,null,"Date:"]
[]
[]
[null,"Hiring Agency","Company Name","Prime Contractor","Vessel Name","Date Used","Solvent Products Used","VOC g/l","Vapor Pressure mm/hg","Initial boiling Point °C","Gallons of Solvent Issued","Gallons of Solvent to Waste Disposal           ","Total Gallons Used ","Pounds of VOCs Emitted","Pounds of n-butanol Emitted","Pounds of Xylenes Emitted"]
[null,null,{"$f":"$G$2","v":0},null,null,null,null,{"$f":"IF(ISBLANK(G16),\" \",VLOOKUP($G16,'[1]5. Master Solvent Product List'!$E$5:$S$100,4,FALSE))","v":" "},{"$f":"IF(ISBLANK(G16),\" \",VLOOKUP($G16,'[1]5. Master Solvent Product List'!$E$5:$S$100,7,FALSE))","v":" "},{"$f":"IF(ISBLANK(G16),\" \",VLOOKUP($G16,'[1]5. Master Solvent Product List'!$E$5:$S$100,12,FALSE))","v":" "},null,null,{"$f":"IF(ISBLANK(K16),0,K16-L16)","v":0},{"$f":"IF(ISBLANK(K16),0,(H16/120)*M16)","v":0},{"$f":"IF(ISBLANK(K16),0,(H16/120)*(VLOOKUP($G16,'[1]5. Master Solvent Product List'!$E$5:$Z$25,20,FALSE)))","v":0},{"$f":"IF(ISBLANK(K16),0,(H16/120)*(VLOOKUP($G16,'[1]5. Master Solvent Product List'!$E$5:$Z$25,22,FALSE)))","v":0}]
[null,null,0,null,null,null,null,{"$f":"IF(ISBLANK(G17),\" \",VLOOKUP($G17,'[1]5. Master Solvent Product List'!$E$5:$S$100,4,FALSE))","v":" "},{"$f":"IF(ISBLANK(G17),\" \",VLOOKUP($G17,'[1]5. Master Solvent Product List'!$E$5:$S$100,7,FALSE))","v":" "},{"$f":"IF(ISBLANK(G17),\" \",VLOOKUP($G17,'[1]5. Master Solvent Product List'!$E$5:$S$100,12,FALSE))","v":" "},null,null,{"$f":"IF(ISBLANK(K17),0,K17-L17)","v":0},{"$f":"IF(ISBLANK(K17),0,(H17/120)*M17)","v":0},{"$f":"IF(ISBLANK(K17),0,(H17/120)*(VLOOKUP($G17,'[1]5. Master Solvent Product List'!$E$5:$Z$25,20,FALSE)))","v":0},{"$f":"IF(ISBLANK(K17),0,(H17/120)*(VLOOKUP($G17,'[1]5. Master Solvent Product List'!$E$5:$Z$25,22,FALSE)))","v":0}]
[null,null,0,null,null,null,null,{"$f":"IF(ISBLANK(G18),\" \",VLOOKUP($G18,'[1]5. Master Solvent Product List'!$E$5:$S$100,4,FALSE))","v":" "},{"$f":"IF(ISBLANK(G18),\" \",VLOOKUP($G18,'[1]5. Master Solvent Product List'!$E$5:$S$100,7,FALSE))","v":" "},{"$f":"IF(ISBLANK(G18),\" \",VLOOKUP($G18,'[1]5. Master Solvent Product List'!$E$5:$S$100,12,FALSE))","v":" "},null,null,0,0,{"$f":"IF(ISBLANK(K18),0,(H18/120)*(VLOOKUP($G18,'[1]5. Master Solvent Product List'!$E$5:$Z$25,20,FALSE)))","v":0},{"$f":"IF(ISBLANK(K18),0,(H18/120)*(VLOOKUP($G18,'[1]5. Master Solvent Product List'!$E$5:$Z$25,22,FALSE)))","v":0}]
[null,null,0,null,null,null,null,{"$f":"IF(ISBLANK(G19),\" \",VLOOKUP($G19,'[1]5. Master Solvent Product List'!$E$5:$S$100,4,FALSE))","v":" "},{"$f":"IF(ISBLANK(G19),\" \",VLOOKUP($G19,'[1]5. Master Solvent Product List'!$E$5:$S$100,7,FALSE))","v":" "},{"$f":"IF(ISBLANK(G19),\" \",VLOOKUP($G19,'[1]5. Master Solvent Product List'!$E$5:$S$100,12,FALSE))","v":" "},null,null,0,0,{"$f":"IF(ISBLANK(K19),0,(H19/120)*(VLOOKUP($G19,'[1]5. Master Solvent Product List'!$E$5:$Z$25,20,FALSE)))","v":0},{"$f":"IF(ISBLANK(K19),0,(H19/120)*(VLOOKUP($G19,'[1]5. Master Solvent Product List'!$E$5:$Z$25,22,FALSE)))","v":0},"`"]
[null,null,0,null,null,null,null,{"$f":"IF(ISBLANK(G20),\" \",VLOOKUP($G20,'[1]5. Master Solvent Product List'!$E$5:$S$100,4,FALSE))","v":" "},{"$f":"IF(ISBLANK(G20),\" \",VLOOKUP($G20,'[1]5. Master Solvent Product List'!$E$5:$S$100,7,FALSE))","v":" "},{"$f":"IF(ISBLANK(G20),\" \",VLOOKUP($G20,'[1]5. Master Solvent Product List'!$E$5:$S$100,12,FALSE))","v":" "},null,null,0,0,{"$f":"IF(ISBLANK(K20),0,(H20/120)*(VLOOKUP($G20,'[1]5. Master Solvent Product List'!$E$5:$Z$25,20,FALSE)))","v":0},{"$f":"IF(ISBLANK(K20),0,(H20/120)*(VLOOKUP($G20,'[1]5. Master Solvent Product List'!$E$5:$Z$25,22,FALSE)))","v":0}]
[null,null,0,null,null,null,null,{"$f":"IF(ISBLANK(G21),\" \",VLOOKUP($G21,'[1]5. Master Solvent Product List'!$E$5:$S$100,4,FALSE))","v":" "},{"$f":"IF(ISBLANK(G21),\" \",VLOOKUP($G21,'[1]5. Master Solvent Product List'!$E$5:$S$100,7,FALSE))","v":" "},{"$f":"IF(ISBLANK(G21),\" \",VLOOKUP($G21,'[1]5. Master Solvent Product List'!$E$5:$S$100,12,FALSE))","v":" "},null,null,0,0,{"$f":"IF(ISBLANK(K21),0,(H21/120)*(VLOOKUP($G21,'[1]5. Master Solvent Product List'!$E$5:$Z$25,20,FALSE)))","v":0},{"$f":"IF(ISBLANK(K21),0,(H21/120)*(VLOOKUP($G21,'[1]5. Master Solvent Product List'!$E$5:$Z$25,22,FALSE)))","v":0}]
[null,null,0,null,null,null,null,{"$f":"IF(ISBLANK(G22),\" \",VLOOKUP($G22,'[1]5. Master Solvent Product List'!$E$5:$S$100,4,FALSE))","v":" "},{"$f":"IF(ISBLANK(G22),\" \",VLOOKUP($G22,'[1]5. Master Solvent Product List'!$E$5:$S$100,7,FALSE))","v":" "},{"$f":"IF(ISBLANK(G22),\" \",VLOOKUP($G22,'[1]5. Master Solvent Product List'!$E$5:$S$100,12,FALSE))","v":" "},null,null,0,0,{"$f":"IF(ISBLANK(K22),0,(H22/120)*(VLOOKUP($G22,'[1]5. Master Solvent Product List'!$E$5:$Z$25,20,FALSE)))","v":0},{"$f":"IF(ISBLANK(K22),0,(H22/120)*(VLOOKUP($G22,'[1]5. Master Solvent Product List'!$E$5:$Z$25,22,FALSE)))","v":0}]
[null,null,0,null,null,null,null,{"$f":"IF(ISBLANK(G23),\" \",VLOOKUP($G23,'[1]5. Master Solvent Product List'!$E$5:$S$100,4,FALSE))","v":" "},{"$f":"IF(ISBLANK(G23),\" \",VLOOKUP($G23,'[1]5. Master Solvent Product List'!$E$5:$S$100,7,FALSE))","v":" "},{"$f":"IF(ISBLANK(G23),\" \",VLOOKUP($G23,'[1]5. Master Solvent Product List'!$E$5:$S$100,12,FALSE))","v":" "},null,null,0,0,{"$f":"IF(ISBLANK(K23),0,(H23/120)*(VLOOKUP($G23,'[1]5. Master Solvent Product List'!$E$5:$Z$25,20,FALSE)))","v":0},{"$f":"IF(ISBLANK(K23),0,(H23/120)*(VLOOKUP($G23,'[1]5. Master Solvent Product List'!$E$5:$Z$25,22,FALSE)))","v":0}]
[null,null,0,null,null,null,null,{"$f":"IF(ISBLANK(G24),\" \",VLOOKUP($G24,'[1]5. Master Solvent Product List'!$E$5:$S$100,4,FALSE))","v":" "},{"$f":"IF(ISBLANK(G24),\" \",VLOOKUP($G24,'[1]5. Master Solvent Product List'!$E$5:$S$100,7,FALSE))","v":" "},{"$f":"IF(ISBLANK(G24),\" \",VLOOKUP($G24,'[1]5. Master Solvent Product List'!$E$5:$S$100,12,FALSE))","v":" "},null,null,0,0,{"$f":"IF(ISBLANK(K24),0,(H24/120)*(VLOOKUP($G24,'[1]5. Master Solvent Product List'!$E$5:$Z$25,20,FALSE)))","v":0},{"$f":"IF(ISBLANK(K24),0,(H24/120)*(VLOOKUP($G24,'[1]5. Master Solvent Product List'!$E$5:$Z$25,22,FALSE)))","v":0}]
[null,null,0,null,null,null,null,{"$f":"IF(ISBLANK(G25),\" \",VLOOKUP($G25,'[1]5. Master Solvent Product List'!$E$5:$S$100,4,FALSE))","v":" "},{"$f":"IF(ISBLANK(G25),\" \",VLOOKUP($G25,'[1]5. Master Solvent Product List'!$E$5:$S$100,7,FALSE))","v":" "},{"$f":"IF(ISBLANK(G25),\" \",VLOOKUP($G25,'[1]5. Master Solvent Product List'!$E$5:$S$100,12,FALSE))","v":" "},null,null,0,0,{"$f":"IF(ISBLANK(K25),0,(H25/120)*(VLOOKUP($G25,'[1]5. Master Solvent Product List'!$E$5:$Z$25,20,FALSE)))","v":0},{"$f":"IF(ISBLANK(K25),0,(H25/120)*(VLOOKUP($G25,'[1]5. Master Solvent Product List'!$E$5:$Z$25,22,FALSE)))","v":0}]
[null,null,0,null,null,null,null,{"$f":"IF(ISBLANK(G26),\" \",VLOOKUP($G26,'[1]5. Master Solvent Product List'!$E$5:$S$100,4,FALSE))","v":" "},{"$f":"IF(ISBLANK(G26),\" \",VLOOKUP($G26,'[1]5. Master Solvent Product List'!$E$5:$S$100,7,FALSE))","v":" "},{"$f":"IF(ISBLANK(G26),\" \",VLOOKUP($G26,'[1]5. Master Solvent Product List'!$E$5:$S$100,12,FALSE))","v":" "},null,null,0,0,{"$f":"IF(ISBLANK(K26),0,(H26/120)*(VLOOKUP($G26,'[1]5. Master Solvent Product List'!$E$5:$Z$25,20,FALSE)))","v":0},{"$f":"IF(ISBLANK(K26),0,(H26/120)*(VLOOKUP($G26,'[1]5. Master Solvent Product List'!$E$5:$Z$25,22,FALSE)))","v":0}]
[null,null,0,null,null,null,null,{"$f":"IF(ISBLANK(G27),\" \",VLOOKUP($G27,'[1]5. Master Solvent Product List'!$E$5:$S$100,4,FALSE))","v":" "},{"$f":"IF(ISBLANK(G27),\" \",VLOOKUP($G27,'[1]5. Master Solvent Product List'!$E$5:$S$100,7,FALSE))","v":" "},{"$f":"IF(ISBLANK(G27),\" \",VLOOKUP($G27,'[1]5. Master Solvent Product List'!$E$5:$S$100,12,FALSE))","v":" "},null,null,0,0,{"$f":"IF(ISBLANK(K27),0,(H27/120)*(VLOOKUP($G27,'[1]5. Master Solvent Product List'!$E$5:$Z$25,20,FALSE)))","v":0},{"$f":"IF(ISBLANK(K27),0,(H27/120)*(VLOOKUP($G27,'[1]5. Master Solvent Product List'!$E$5:$Z$25,22,FALSE)))","v":0}]
[null,null,0,null,null,null,null,{"$f":"IF(ISBLANK(G28),\" \",VLOOKUP($G28,'[1]5. Master Solvent Product List'!$E$5:$S$100,4,FALSE))","v":" "},{"$f":"IF(ISBLANK(G28),\" \",VLOOKUP($G28,'[1]5. Master Solvent Product List'!$E$5:$S$100,7,FALSE))","v":" "},{"$f":"IF(ISBLANK(G28),\" \",VLOOKUP($G28,'[1]5. Master Solvent Product List'!$E$5:$S$100,12,FALSE))","v":" "},null,null,0,0,{"$f":"IF(ISBLANK(K28),0,(H28/120)*(VLOOKUP($G28,'[1]5. Master Solvent Product List'!$E$5:$Z$25,20,FALSE)))","v":0},{"$f":"IF(ISBLANK(K28),0,(H28/120)*(VLOOKUP($G28,'[1]5. Master Solvent Product List'!$E$5:$Z$25,22,FALSE)))","v":0}]
[null,null,0,null,null,null,null,{"$f":"IF(ISBLANK(G29),\" \",VLOOKUP($G29,'[1]5. Master Solvent Product List'!$E$5:$S$100,4,FALSE))","v":" "},{"$f":"IF(ISBLANK(G29),\" \",VLOOKUP($G29,'[1]5. Master Solvent Product List'!$E$5:$S$100,7,FALSE))","v":" "},{"$f":"IF(ISBLANK(G29),\" \",VLOOKUP($G29,'[1]5. Master Solvent Product List'!$E$5:$S$100,12,FALSE))","v":" "},null,null,0,0,{"$f":"IF(ISBLANK(K29),0,(H29/120)*(VLOOKUP($G29,'[1]5. Master Solvent Product List'!$E$5:$Z$25,20,FALSE)))","v":0},{"$f":"IF(ISBLANK(K29),0,(H29/120)*(VLOOKUP($G29,'[1]5. Master Solvent Product List'!$E$5:$Z$25,22,FALSE)))","v":0}]
[null,null,0,null,null,null,null,{"$f":"IF(ISBLANK(G30),\" \",VLOOKUP($G30,'[1]5. Master Solvent Product List'!$E$5:$S$100,4,FALSE))","v":" "},{"$f":"IF(ISBLANK(G30),\" \",VLOOKUP($G30,'[1]5. Master Solvent Product List'!$E$5:$S$100,7,FALSE))","v":" "},{"$f":"IF(ISBLANK(G30),\" \",VLOOKUP($G30,'[1]5. Master Solvent Product List'!$E$5:$S$100,12,FALSE))","v":" "},null,null,0,0,{"$f":"IF(ISBLANK(K30),0,(H30/120)*(VLOOKUP($G30,'[1]5. Master Solvent Product List'!$E$5:$Z$25,20,FALSE)))","v":0},{"$f":"IF(ISBLANK(K30),0,(H30/120)*(VLOOKUP($G30,'[1]5. Master Solvent Product List'!$E$5:$Z$25,22,FALSE)))","v":0}]
[null,null,0,null,null,null,null,{"$f":"IF(ISBLANK(G31),\" \",VLOOKUP($G31,'[1]5. Master Solvent Product List'!$E$5:$S$100,4,FALSE))","v":" "},{"$f":"IF(ISBLANK(G31),\" \",VLOOKUP($G31,'[1]5. Master Solvent Product List'!$E$5:$S$100,7,FALSE))","v":" "},{"$f":"IF(ISBLANK(G31),\" \",VLOOKUP($G31,'[1]5. Master Solvent Product List'!$E$5:$S$100,12,FALSE))","v":" "},null,null,0,0,{"$f":"IF(ISBLANK(K31),0,(H31/120)*(VLOOKUP($G31,'[1]5. Master Solvent Product List'!$E$5:$Z$25,20,FALSE)))","v":0},{"$f":"IF(ISBLANK(K31),0,(H31/120)*(VLOOKUP($G31,'[1]5. Master Solvent Product List'!$E$5:$Z$25,22,FALSE)))","v":0}]
[null,null,0,null,null,null,null,{"$f":"IF(ISBLANK(G32),\" \",VLOOKUP($G32,'[1]5. Master Solvent Product List'!$E$5:$S$100,4,FALSE))","v":" "},{"$f":"IF(ISBLANK(G32),\" \",VLOOKUP($G32,'[1]5. Master Solvent Product List'!$E$5:$S$100,7,FALSE))","v":" "},{"$f":"IF(ISBLANK(G32),\" \",VLOOKUP($G32,'[1]5. Master Solvent Product List'!$E$5:$S$100,12,FALSE))","v":" "},null,null,0,0,{"$f":"IF(ISBLANK(K32),0,(H32/120)*(VLOOKUP($G32,'[1]5. Master Solvent Product List'!$E$5:$Z$25,20,FALSE)))","v":0},{"$f":"IF(ISBLANK(K32),0,(H32/120)*(VLOOKUP($G32,'[1]5. Master Solvent Product List'!$E$5:$Z$25,22,FALSE)))","v":0}]
[null,null,0,null,null,null,null,{"$f":"IF(ISBLANK(G33),\" \",VLOOKUP($G33,'[1]5. Master Solvent Product List'!$E$5:$S$100,4,FALSE))","v":" "},{"$f":"IF(ISBLANK(G33),\" \",VLOOKUP($G33,'[1]5. Master Solvent Product List'!$E$5:$S$100,7,FALSE))","v":" "},{"$f":"IF(ISBLANK(G33),\" \",VLOOKUP($G33,'[1]5. Master Solvent Product List'!$E$5:$S$100,12,FALSE))","v":" "},null,null,0,0,{"$f":"IF(ISBLANK(K33),0,(H33/120)*(VLOOKUP($G33,'[1]5. Master Solvent Product List'!$E$5:$Z$25,20,FALSE)))","v":0},{"$f":"IF(ISBLANK(K33),0,(H33/120)*(VLOOKUP($G33,'[1]5. Master Solvent Product List'!$E$5:$Z$25,22,FALSE)))","v":0}]
[null,null,0,null,null,null,null,{"$f":"IF(ISBLANK(G34),\" \",VLOOKUP($G34,'[1]5. Master Solvent Product List'!$E$5:$S$100,4,FALSE))","v":" "},{"$f":"IF(ISBLANK(G34),\" \",VLOOKUP($G34,'[1]5. Master Solvent Product List'!$E$5:$S$100,7,FALSE))","v":" "},{"$f":"IF(ISBLANK(G34),\" \",VLOOKUP($G34,'[1]5. Master Solvent Product List'!$E$5:$S$100,12,FALSE))","v":" "},null,null,0,0,{"$f":"IF(ISBLANK(K34),0,(H34/120)*(VLOOKUP($G34,'[1]5. Master Solvent Product List'!$E$5:$Z$25,20,FALSE)))","v":0},{"$f":"IF(ISBLANK(K34),0,(H34/120)*(VLOOKUP($G34,'[1]5. Master Solvent Product List'!$E$5:$Z$25,22,FALSE)))","v":0}]
[null,null,0,null,null,null,null,{"$f":"IF(ISBLANK(G35),\" \",VLOOKUP($G35,'[1]5. Master Solvent Product List'!$E$5:$S$100,4,FALSE))","v":" "},{"$f":"IF(ISBLANK(G35),\" \",VLOOKUP($G35,'[1]5. Master Solvent Product List'!$E$5:$S$100,7,FALSE))","v":" "},{"$f":"IF(ISBLANK(G35),\" \",VLOOKUP($G35,'[1]5. Master Solvent Product List'!$E$5:$S$100,12,FALSE))","v":" "},null,null,0,0,{"$f":"IF(ISBLANK(K35),0,(H35/120)*(VLOOKUP($G35,'[1]5. Master Solvent Product List'!$E$5:$Z$25,20,FALSE)))","v":0},{"$f":"IF(ISBLANK(K35),0,(H35/120)*(VLOOKUP($G35,'[1]5. Master Solvent Product List'!$E$5:$Z$25,22,FALSE)))","v":0}]
[null,null,0,null,null,null,null,{"$f":"IF(ISBLANK(G36),\" \",VLOOKUP($G36,'[1]5. Master Solvent Product List'!$E$5:$S$100,4,FALSE))","v":" "},{"$f":"IF(ISBLANK(G36),\" \",VLOOKUP($G36,'[1]5. Master Solvent Product List'!$E$5:$S$100,7,FALSE))","v":" "},{"$f":"IF(ISBLANK(G36),\" \",VLOOKUP($G36,'[1]5. Master Solvent Product List'!$E$5:$S$100,12,FALSE))","v":" "},null,null,0,0,{"$f":"IF(ISBLANK(K36),0,(H36/120)*(VLOOKUP($G36,'[1]5. Master Solvent Product List'!$E$5:$Z$25,20,FALSE)))","v":0},{"$f":"IF(ISBLANK(K36),0,(H36/120)*(VLOOKUP($G36,'[1]5. Master Solvent Product List'!$E$5:$Z$25,22,FALSE)))","v":0}]
[null,null,0,null,null,null,null,{"$f":"IF(ISBLANK(G37),\" \",VLOOKUP($G37,'[1]5. Master Solvent Product List'!$E$5:$S$100,4,FALSE))","v":" "},{"$f":"IF(ISBLANK(G37),\" \",VLOOKUP($G37,'[1]5. Master Solvent Product List'!$E$5:$S$100,7,FALSE))","v":" "},{"$f":"IF(ISBLANK(G37),\" \",VLOOKUP($G37,'[1]5. Master Solvent Product List'!$E$5:$S$100,12,FALSE))","v":" "},null,null,0,0,{"$f":"IF(ISBLANK(K37),0,(H37/120)*(VLOOKUP($G37,'[1]5. Master Solvent Product List'!$E$5:$Z$25,20,FALSE)))","v":0},{"$f":"IF(ISBLANK(K37),0,(H37/120)*(VLOOKUP($G37,'[1]5. Master Solvent Product List'!$E$5:$Z$25,22,FALSE)))","v":0}]
[null,null,0,null,null,null,null,{"$f":"IF(ISBLANK(G38),\" \",VLOOKUP($G38,'[1]5. Master Solvent Product List'!$E$5:$S$100,4,FALSE))","v":" "},{"$f":"IF(ISBLANK(G38),\" \",VLOOKUP($G38,'[1]5. Master Solvent Product List'!$E$5:$S$100,7,FALSE))","v":" "},{"$f":"IF(ISBLANK(G38),\" \",VLOOKUP($G38,'[1]5. Master Solvent Product List'!$E$5:$S$100,12,FALSE))","v":" "},null,null,0,0,{"$f":"IF(ISBLANK(K38),0,(H38/120)*(VLOOKUP($G38,'[1]5. Master Solvent Product List'!$E$5:$Z$25,20,FALSE)))","v":0},{"$f":"IF(ISBLANK(K38),0,(H38/120)*(VLOOKUP($G38,'[1]5. Master Solvent Product List'!$E$5:$Z$25,22,FALSE)))","v":0}]
[null,null,0,null,null,null,null,{"$f":"IF(ISBLANK(G39),\" \",VLOOKUP($G39,'[1]5. Master Solvent Product List'!$E$5:$S$100,4,FALSE))","v":" "},{"$f":"IF(ISBLANK(G39),\" \",VLOOKUP($G39,'[1]5. Master Solvent Product List'!$E$5:$S$100,7,FALSE))","v":" "},{"$f":"IF(ISBLANK(G39),\" \",VLOOKUP($G39,'[1]5. Master Solvent Product List'!$E$5:$S$100,12,FALSE))","v":" "},null,null,0,0,{"$f":"IF(ISBLANK(K39),0,(H39/120)*(VLOOKUP($G39,'[1]5. Master Solvent Product List'!$E$5:$Z$25,20,FALSE)))","v":0},{"$f":"IF(ISBLANK(K39),0,(H39/120)*(VLOOKUP($G39,'[1]5. Master Solvent Product List'!$E$5:$Z$25,22,FALSE)))","v":0}]
[null,null,0,null,null,null,null,{"$f":"IF(ISBLANK(G40),\" \",VLOOKUP($G40,'[1]5. Master Solvent Product List'!$E$5:$S$100,4,FALSE))","v":" "},{"$f":"IF(ISBLANK(G40),\" \",VLOOKUP($G40,'[1]5. Master Solvent Product List'!$E$5:$S$100,7,FALSE))","v":" "},{"$f":"IF(ISBLANK(G40),\" \",VLOOKUP($G40,'[1]5. Master Solvent Product List'!$E$5:$S$100,12,FALSE))","v":" "},null,null,0,0,{"$f":"IF(ISBLANK(K40),0,(H40/120)*(VLOOKUP($G40,'[1]5. Master Solvent Product List'!$E$5:$Z$25,20,FALSE)))","v":0},{"$f":"IF(ISBLANK(K40),0,(H40/120)*(VLOOKUP($G40,'[1]5. Master Solvent Product List'!$E$5:$Z$25,22,FALSE)))","v":0}]
[null,null,0,null,null,null,null,{"$f":"IF(ISBLANK(G41),\" \",VLOOKUP($G41,'[1]5. Master Solvent Product List'!$E$5:$S$100,4,FALSE))","v":" "},{"$f":"IF(ISBLANK(G41),\" \",VLOOKUP($G41,'[1]5. Master Solvent Product List'!$E$5:$S$100,7,FALSE))","v":" "},{"$f":"IF(ISBLANK(G41),\" \",VLOOKUP($G41,'[1]5. Master Solvent Product List'!$E$5:$S$100,12,FALSE))","v":" "},null,null,0,0,{"$f":"IF(ISBLANK(K41),0,(H41/120)*(VLOOKUP($G41,'[1]5. Master Solvent Product List'!$E$5:$Z$25,20,FALSE)))","v":0},{"$f":"IF(ISBLANK(K41),0,(H41/120)*(VLOOKUP($G41,'[1]5. Master Solvent Product List'!$E$5:$Z$25,22,FALSE)))","v":0}]
[null,null,0,null,null,null,null,{"$f":"IF(ISBLANK(G42),\" \",VLOOKUP($G42,'[1]5. Master Solvent Product List'!$E$5:$S$100,4,FALSE))","v":" "},{"$f":"IF(ISBLANK(G42),\" \",VLOOKUP($G42,'[1]5. Master Solvent Product List'!$E$5:$S$100,7,FALSE))","v":" "},{"$f":"IF(ISBLANK(G42),\" \",VLOOKUP($G42,'[1]5. Master Solvent Product List'!$E$5:$S$100,12,FALSE))","v":" "},null,null,0,0,{"$f":"IF(ISBLANK(K42),0,(H42/120)*(VLOOKUP($G42,'[1]5. Master Solvent Product List'!$E$5:$Z$25,20,FALSE)))","v":0},{"$f":"IF(ISBLANK(K42),0,(H42/120)*(VLOOKUP($G42,'[1]5. Master Solvent Product List'!$E$5:$Z$25,22,FALSE)))","v":0}]
[null,null,0,null,null,null,null,{"$f":"IF(ISBLANK(G43),\" \",VLOOKUP($G43,'[1]5. Master Solvent Product List'!$E$5:$S$100,4,FALSE))","v":" "},{"$f":"IF(ISBLANK(G43),\" \",VLOOKUP($G43,'[1]5. Master Solvent Product List'!$E$5:$S$100,7,FALSE))","v":" "},{"$f":"IF(ISBLANK(G43),\" \",VLOOKUP($G43,'[1]5. Master Solvent Product List'!$E$5:$S$100,12,FALSE))","v":" "},null,null,0,0,{"$f":"IF(ISBLANK(K43),0,(H43/120)*(VLOOKUP($G43,'[1]5. Master Solvent Product List'!$E$5:$Z$25,20,FALSE)))","v":0},{"$f":"IF(ISBLANK(K43),0,(H43/120)*(VLOOKUP($G43,'[1]5. Master Solvent Product List'!$E$5:$Z$25,22,FALSE)))","v":0}]
[null,null,0,null,null,null,null,{"$f":"IF(ISBLANK(G44),\" \",VLOOKUP($G44,'[1]5. Master Solvent Product List'!$E$5:$S$100,4,FALSE))","v":" "},{"$f":"IF(ISBLANK(G44),\" \",VLOOKUP($G44,'[1]5. Master Solvent Product List'!$E$5:$S$100,7,FALSE))","v":" "},{"$f":"IF(ISBLANK(G44),\" \",VLOOKUP($G44,'[1]5. Master Solvent Product List'!$E$5:$S$100,12,FALSE))","v":" "},null,null,0,0,{"$f":"IF(ISBLANK(K44),0,(H44/120)*(VLOOKUP($G44,'[1]5. Master Solvent Product List'!$E$5:$Z$25,20,FALSE)))","v":0},{"$f":"IF(ISBLANK(K44),0,(H44/120)*(VLOOKUP($G44,'[1]5. Master Solvent Product List'!$E$5:$Z$25,22,FALSE)))","v":0}]
[null,null,0,null,null,null,null,{"$f":"IF(ISBLANK(G45),\" \",VLOOKUP($G45,'[1]5. Master Solvent Product List'!$E$5:$S$100,4,FALSE))","v":" "},{"$f":"IF(ISBLANK(G45),\" \",VLOOKUP($G45,'[1]5. Master Solvent Product List'!$E$5:$S$100,7,FALSE))","v":" "},{"$f":"IF(ISBLANK(G45),\" \",VLOOKUP($G45,'[1]5. Master Solvent Product List'!$E$5:$S$100,12,FALSE))","v":" "},null,null,0,0,{"$f":"IF(ISBLANK(K45),0,(H45/120)*(VLOOKUP($G45,'[1]5. Master Solvent Product List'!$E$5:$Z$25,20,FALSE)))","v":0},{"$f":"IF(ISBLANK(K45),0,(H45/120)*(VLOOKUP($G45,'[1]5. Master Solvent Product List'!$E$5:$Z$25,22,FALSE)))","v":0}]
[null,null,0,null,null,null,null,{"$f":"IF(ISBLANK(G46),\" \",VLOOKUP($G46,'[1]5. Master Solvent Product List'!$E$5:$S$100,4,FALSE))","v":" "},{"$f":"IF(ISBLANK(G46),\" \",VLOOKUP($G46,'[1]5. Master Solvent Product List'!$E$5:$S$100,7,FALSE))","v":" "},{"$f":"IF(ISBLANK(G46),\" \",VLOOKUP($G46,'[1]5. Master Solvent Product List'!$E$5:$S$100,12,FALSE))","v":" "},null,null,0,0,{"$f":"IF(ISBLANK(K46),0,(H46/120)*(VLOOKUP($G46,'[1]5. Master Solvent Product List'!$E$5:$Z$25,20,FALSE)))","v":0},{"$f":"IF(ISBLANK(K46),0,(H46/120)*(VLOOKUP($G46,'[1]5. Master Solvent Product List'!$E$5:$Z$25,22,FALSE)))","v":0}]
[null,null,0,null,null,null,null,{"$f":"IF(ISBLANK(G47),\" \",VLOOKUP($G47,'[1]5. Master Solvent Product List'!$E$5:$S$100,4,FALSE))","v":" "},{"$f":"IF(ISBLANK(G47),\" \",VLOOKUP($G47,'[1]5. Master Solvent Product List'!$E$5:$S$100,7,FALSE))","v":" "},{"$f":"IF(ISBLANK(G47),\" \",VLOOKUP($G47,'[1]5. Master Solvent Product List'!$E$5:$S$100,12,FALSE))","v":" "},null,null,0,0,{"$f":"IF(ISBLANK(K47),0,(H47/120)*(VLOOKUP($G47,'[1]5. Master Solvent Product List'!$E$5:$Z$25,20,FALSE)))","v":0},{"$f":"IF(ISBLANK(K47),0,(H47/120)*(VLOOKUP($G47,'[1]5. Master Solvent Product List'!$E$5:$Z$25,22,FALSE)))","v":0}]
[null,null,{"$f":"$G$2","v":0},null,null,null,null,{"$f":"IF(ISBLANK(G48),\" \",VLOOKUP($G48,'[1]5. Master Solvent Product List'!$E$5:$S$100,4,FALSE))","v":" "},{"$f":"IF(ISBLANK(G48),\" \",VLOOKUP($G48,'[1]5. Master Solvent Product List'!$E$5:$S$100,7,FALSE))","v":" "},{"$f":"IF(ISBLANK(G48),\" \",VLOOKUP($G48,'[1]5. Master Solvent Product List'!$E$5:$S$100,12,FALSE))","v":" "},null,null,0,0,{"$f":"IF(ISBLANK(K48),0,(H48/120)*(VLOOKUP($G48,'[1]5. Master Solvent Product List'!$E$5:$Z$25,20,FALSE)))","v":0},{"$f":"IF(ISBLANK(K48),0,(H48/120)*(VLOOKUP($G48,'[1]5. Master Solvent Product List'!$E$5:$Z$25,22,FALSE)))","v":0}]
[null,null,0,null,null,null,null,{"$f":"IF(ISBLANK(G49),\" \",VLOOKUP($G49,'[1]5. Master Solvent Product List'!$E$5:$S$100,4,FALSE))","v":" "},{"$f":"IF(ISBLANK(G49),\" \",VLOOKUP($G49,'[1]5. Master Solvent Product List'!$E$5:$S$100,7,FALSE))","v":" "},{"$f":"IF(ISBLANK(G49),\" \",VLOOKUP($G49,'[1]5. Master Solvent Product List'!$E$5:$S$100,12,FALSE))","v":" "},null,null,0,0,{"$f":"IF(ISBLANK(K49),0,(H49/120)*(VLOOKUP($G49,'[1]5. Master Solvent Product List'!$E$5:$Z$25,20,FALSE)))","v":0},{"$f":"IF(ISBLANK(K49),0,(H49/120)*(VLOOKUP($G49,'[1]5. Master Solvent Product List'!$E$5:$Z$25,22,FALSE)))","v":0}]
[null,null,0,null,null,null,null,{"$f":"IF(ISBLANK(G50),\" \",VLOOKUP($G50,'[1]5. Master Solvent Product List'!$E$5:$S$100,4,FALSE))","v":" "},{"$f":"IF(ISBLANK(G50),\" \",VLOOKUP($G50,'[1]5. Master Solvent Product List'!$E$5:$S$100,7,FALSE))","v":" "},{"$f":"IF(ISBLANK(G50),\" \",VLOOKUP($G50,'[1]5. Master Solvent Product List'!$E$5:$S$100,12,FALSE))","v":" "},null,null,0,0,{"$f":"IF(ISBLANK(K50),0,(H50/120)*(VLOOKUP($G50,'[1]5. Master Solvent Product List'!$E$5:$Z$25,20,FALSE)))","v":0},{"$f":"IF(ISBLANK(K50),0,(H50/120)*(VLOOKUP($G50,'[1]5. Master Solvent Product List'!$E$5:$Z$25,22,FALSE)))","v":0}]
[null,null,0,null,null,null,null,{"$f":"IF(ISBLANK(G51),\" \",VLOOKUP($G51,'[1]5. Master Solvent Product List'!$E$5:$S$100,4,FALSE))","v":" "},{"$f":"IF(ISBLANK(G51),\" \",VLOOKUP($G51,'[1]5. Master Solvent Product List'!$E$5:$S$100,7,FALSE))","v":" "},{"$f":"IF(ISBLANK(G51),\" \",VLOOKUP($G51,'[1]5. Master Solvent Product List'!$E$5:$S$100,12,FALSE))","v":" "},null,null,0,0,{"$f":"IF(ISBLANK(K51),0,(H51/120)*(VLOOKUP($G51,'[1]5. Master Solvent Product List'!$E$5:$Z$25,20,FALSE)))","v":0},{"$f":"IF(ISBLANK(K51),0,(H51/120)*(VLOOKUP($G51,'[1]5. Master Solvent Product List'!$E$5:$Z$25,22,FALSE)))","v":0}]
[null,null,0,null,null,null,null,{"$f":"IF(ISBLANK(G52),\" \",VLOOKUP($G52,'[1]5. Master Solvent Product List'!$E$5:$S$100,4,FALSE))","v":" "},{"$f":"IF(ISBLANK(G52),\" \",VLOOKUP($G52,'[1]5. Master Solvent Product List'!$E$5:$S$100,7,FALSE))","v":" "},{"$f":"IF(ISBLANK(G52),\" \",VLOOKUP($G52,'[1]5. Master Solvent Product List'!$E$5:$S$100,12,FALSE))","v":" "},null,null,0,0,{"$f":"IF(ISBLANK(K52),0,(H52/120)*(VLOOKUP($G52,'[1]5. Master Solvent Product List'!$E$5:$Z$25,20,FALSE)))","v":0},{"$f":"IF(ISBLANK(K52),0,(H52/120)*(VLOOKUP($G52,'[1]5. Master Solvent Product List'!$E$5:$Z$25,22,FALSE)))","v":0}]
[null,null,0,null,null,null,null,{"$f":"IF(ISBLANK(G53),\" \",VLOOKUP($G53,'[1]5. Master Solvent Product List'!$E$5:$S$100,4,FALSE))","v":" "},{"$f":"IF(ISBLANK(G53),\" \",VLOOKUP($G53,'[1]5. Master Solvent Product List'!$E$5:$S$100,7,FALSE))","v":" "},{"$f":"IF(ISBLANK(G53),\" \",VLOOKUP($G53,'[1]5. Master Solvent Product List'!$E$5:$S$100,12,FALSE))","v":" "},null,null,0,0,{"$f":"IF(ISBLANK(K53),0,(H53/120)*(VLOOKUP($G53,'[1]5. Master Solvent Product List'!$E$5:$Z$25,20,FALSE)))","v":0},{"$f":"IF(ISBLANK(K53),0,(H53/120)*(VLOOKUP($G53,'[1]5. Master Solvent Product List'!$E$5:$Z$25,22,FALSE)))","v":0}]
[null,null,0,null,null,null,null,{"$f":"IF(ISBLANK(G54),\" \",VLOOKUP($G54,'[1]5. Master Solvent Product List'!$E$5:$S$100,4,FALSE))","v":" "},{"$f":"IF(ISBLANK(G54),\" \",VLOOKUP($G54,'[1]5. Master Solvent Product List'!$E$5:$S$100,7,FALSE))","v":" "},{"$f":"IF(ISBLANK(G54),\" \",VLOOKUP($G54,'[1]5. Master Solvent Product List'!$E$5:$S$100,12,FALSE))","v":" "},null,null,0,0,{"$f":"IF(ISBLANK(K54),0,(H54/120)*(VLOOKUP($G54,'[1]5. Master Solvent Product List'!$E$5:$Z$25,20,FALSE)))","v":0},{"$f":"IF(ISBLANK(K54),0,(H54/120)*(VLOOKUP($G54,'[1]5. Master Solvent Product List'!$E$5:$Z$25,22,FALSE)))","v":0}]
[null,null,0,null,null,null,null,{"$f":"IF(ISBLANK(G55),\" \",VLOOKUP($G55,'[1]5. Master Solvent Product List'!$E$5:$S$100,4,FALSE))","v":" "},{"$f":"IF(ISBLANK(G55),\" \",VLOOKUP($G55,'[1]5. Master Solvent Product List'!$E$5:$S$100,7,FALSE))","v":" "},{"$f":"IF(ISBLANK(G55),\" \",VLOOKUP($G55,'[1]5. Master Solvent Product List'!$E$5:$S$100,12,FALSE))","v":" "},null,null,0,0,{"$f":"IF(ISBLANK(K55),0,(H55/120)*(VLOOKUP($G55,'[1]5. Master Solvent Product List'!$E$5:$Z$25,20,FALSE)))","v":0},{"$f":"IF(ISBLANK(K55),0,(H55/120)*(VLOOKUP($G55,'[1]5. Master Solvent Product List'!$E$5:$Z$25,22,FALSE)))","v":0}]
[null,null,0,null,null,null,null,{"$f":"IF(ISBLANK(G56),\" \",VLOOKUP($G56,'[1]5. Master Solvent Product List'!$E$5:$S$100,4,FALSE))","v":" "},{"$f":"IF(ISBLANK(G56),\" \",VLOOKUP($G56,'[1]5. Master Solvent Product List'!$E$5:$S$100,7,FALSE))","v":" "},{"$f":"IF(ISBLANK(G56),\" \",VLOOKUP($G56,'[1]5. Master Solvent Product List'!$E$5:$S$100,12,FALSE))","v":" "},null,null,0,0,{"$f":"IF(ISBLANK(K56),0,(H56/120)*(VLOOKUP($G56,'[1]5. Master Solvent Product List'!$E$5:$Z$25,20,FALSE)))","v":0},{"$f":"IF(ISBLANK(K56),0,(H56/120)*(VLOOKUP($G56,'[1]5. Master Solvent Product List'!$E$5:$Z$25,22,FALSE)))","v":0}]
[null,null,0,null,null,null,null,{"$f":"IF(ISBLANK(G57),\" \",VLOOKUP($G57,'[1]5. Master Solvent Product List'!$E$5:$S$100,4,FALSE))","v":" "},{"$f":"IF(ISBLANK(G57),\" \",VLOOKUP($G57,'[1]5. Master Solvent Product List'!$E$5:$S$100,7,FALSE))","v":" "},{"$f":"IF(ISBLANK(G57),\" \",VLOOKUP($G57,'[1]5. Master Solvent Product List'!$E$5:$S$100,12,FALSE))","v":" "},null,null,0,0,{"$f":"IF(ISBLANK(K57),0,(H57/120)*(VLOOKUP($G57,'[1]5. Master Solvent Product List'!$E$5:$Z$25,20,FALSE)))","v":0},{"$f":"IF(ISBLANK(K57),0,(H57/120)*(VLOOKUP($G57,'[1]5. Master Solvent Product List'!$E$5:$Z$25,22,FALSE)))","v":0}]
[null,null,0,null,null,null,null,{"$f":"IF(ISBLANK(G58),\" \",VLOOKUP($G58,'[1]5. Master Solvent Product List'!$E$5:$S$100,4,FALSE))","v":" "},{"$f":"IF(ISBLANK(G58),\" \",VLOOKUP($G58,'[1]5. Master Solvent Product List'!$E$5:$S$100,7,FALSE))","v":" "},{"$f":"IF(ISBLANK(G58),\" \",VLOOKUP($G58,'[1]5. Master Solvent Product List'!$E$5:$S$100,12,FALSE))","v":" "},null,null,0,0,{"$f":"IF(ISBLANK(K58),0,(H58/120)*(VLOOKUP($G58,'[1]5. Master Solvent Product List'!$E$5:$Z$25,20,FALSE)))","v":0},{"$f":"IF(ISBLANK(K58),0,(H58/120)*(VLOOKUP($G58,'[1]5. Master Solvent Product List'!$E$5:$Z$25,22,FALSE)))","v":0}]
[null,null,0,null,null,null,null,{"$f":"IF(ISBLANK(G59),\" \",VLOOKUP($G59,'[1]5. Master Solvent Product List'!$E$5:$S$100,4,FALSE))","v":" "},{"$f":"IF(ISBLANK(G59),\" \",VLOOKUP($G59,'[1]5. Master Solvent Product List'!$E$5:$S$100,7,FALSE))","v":" "},{"$f":"IF(ISBLANK(G59),\" \",VLOOKUP($G59,'[1]5. Master Solvent Product List'!$E$5:$S$100,12,FALSE))","v":" "},null,null,0,0,{"$f":"IF(ISBLANK(K59),0,(H59/120)*(VLOOKUP($G59,'[1]5. Master Solvent Product List'!$E$5:$Z$25,20,FALSE)))","v":0},{"$f":"IF(ISBLANK(K59),0,(H59/120)*(VLOOKUP($G59,'[1]5. Master Solvent Product List'!$E$5:$Z$25,22,FALSE)))","v":0}]
[null,null,0,null,null,null,null,{"$f":"IF(ISBLANK(G60),\" \",VLOOKUP($G60,'[1]5. Master Solvent Product List'!$E$5:$S$100,4,FALSE))","v":" "},{"$f":"IF(ISBLANK(G60),\" \",VLOOKUP($G60,'[1]5. Master Solvent Product List'!$E$5:$S$100,7,FALSE))","v":" "},{"$f":"IF(ISBLANK(G60),\" \",VLOOKUP($G60,'[1]5. Master Solvent Product List'!$E$5:$S$100,12,FALSE))","v":" "},null,null,0,0,{"$f":"IF(ISBLANK(K60),0,(H60/120)*(VLOOKUP($G60,'[1]5. Master Solvent Product List'!$E$5:$Z$25,20,FALSE)))","v":0},{"$f":"IF(ISBLANK(K60),0,(H60/120)*(VLOOKUP($G60,'[1]5. Master Solvent Product List'!$E$5:$Z$25,22,FALSE)))","v":0}]
[null,null,0,null,null,null,null,{"$f":"IF(ISBLANK(G61),\" \",VLOOKUP($G61,'[1]5. Master Solvent Product List'!$E$5:$S$100,4,FALSE))","v":" "},{"$f":"IF(ISBLANK(G61),\" \",VLOOKUP($G61,'[1]5. Master Solvent Product List'!$E$5:$S$100,7,FALSE))","v":" "},{"$f":"IF(ISBLANK(G61),\" \",VLOOKUP($G61,'[1]5. Master Solvent Product List'!$E$5:$S$100,12,FALSE))","v":" "},null,null,0,0,{"$f":"IF(ISBLANK(K61),0,(H61/120)*(VLOOKUP($G61,'[1]5. Master Solvent Product List'!$E$5:$Z$25,20,FALSE)))","v":0},{"$f":"IF(ISBLANK(K61),0,(H61/120)*(VLOOKUP($G61,'[1]5. Master Solvent Product List'!$E$5:$Z$25,22,FALSE)))","v":0}]
[null,null,0,null,null,null,null,{"$f":"IF(ISBLANK(G62),\" \",VLOOKUP($G62,'[1]5. Master Solvent Product List'!$E$5:$S$100,4,FALSE))","v":" "},{"$f":"IF(ISBLANK(G62),\" \",VLOOKUP($G62,'[1]5. Master Solvent Product List'!$E$5:$S$100,7,FALSE))","v":" "},{"$f":"IF(ISBLANK(G62),\" \",VLOOKUP($G62,'[1]5. Master Solvent Product List'!$E$5:$S$100,12,FALSE))","v":" "},null,null,0,0,{"$f":"IF(ISBLANK(K62),0,(H62/120)*(VLOOKUP($G62,'[1]5. Master Solvent Product List'!$E$5:$Z$25,20,FALSE)))","v":0},{"$f":"IF(ISBLANK(K62),0,(H62/120)*(VLOOKUP($G62,'[1]5. Master Solvent Product List'!$E$5:$Z$25,22,FALSE)))","v":0}]
[null,null,0,null,null,null,null,{"$f":"IF(ISBLANK(G63),\" \",VLOOKUP($G63,'[1]5. Master Solvent Product List'!$E$5:$S$100,4,FALSE))","v":" "},{"$f":"IF(ISBLANK(G63),\" \",VLOOKUP($G63,'[1]5. Master Solvent Product List'!$E$5:$S$100,7,FALSE))","v":" "},{"$f":"IF(ISBLANK(G63),\" \",VLOOKUP($G63,'[1]5. Master Solvent Product List'!$E$5:$S$100,12,FALSE))","v":" "},null,null,0,0,{"$f":"IF(ISBLANK(K63),0,(H63/120)*(VLOOKUP($G63,'[1]5. Master Solvent Product List'!$E$5:$Z$25,20,FALSE)))","v":0},{"$f":"IF(ISBLANK(K63),0,(H63/120)*(VLOOKUP($G63,'[1]5. Master Solvent Product List'!$E$5:$Z$25,22,FALSE)))","v":0}]
[null,null,0,null,null,null,null,{"$f":"IF(ISBLANK(G64),\" \",VLOOKUP($G64,'[1]5. Master Solvent Product List'!$E$5:$S$100,4,FALSE))","v":" "},{"$f":"IF(ISBLANK(G64),\" \",VLOOKUP($G64,'[1]5. Master Solvent Product List'!$E$5:$S$100,7,FALSE))","v":" "},{"$f":"IF(ISBLANK(G64),\" \",VLOOKUP($G64,'[1]5. Master Solvent Product List'!$E$5:$S$100,12,FALSE))","v":" "},null,null,0,0,{"$f":"IF(ISBLANK(K64),0,(H64/120)*(VLOOKUP($G64,'[1]5. Master Solvent Product List'!$E$5:$Z$25,20,FALSE)))","v":0},{"$f":"IF(ISBLANK(K64),0,(H64/120)*(VLOOKUP($G64,'[1]5. Master Solvent Product List'!$E$5:$Z$25,22,FALSE)))","v":0}]
[null,null,0,null,null,null,null,{"$f":"IF(ISBLANK(G65),\" \",VLOOKUP($G65,'[1]5. Master Solvent Product List'!$E$5:$S$100,4,FALSE))","v":" "},{"$f":"IF(ISBLANK(G65),\" \",VLOOKUP($G65,'[1]5. Master Solvent Product List'!$E$5:$S$100,7,FALSE))","v":" "},{"$f":"IF(ISBLANK(G65),\" \",VLOOKUP($G65,'[1]5. Master Solvent Product List'!$E$5:$S$100,12,FALSE))","v":" "},null,null,0,0,{"$f":"IF(ISBLANK(K65),0,(H65/120)*(VLOOKUP($G65,'[1]5. Master Solvent Product List'!$E$5:$Z$25,20,FALSE)))","v":0},{"$f":"IF(ISBLANK(K65),0,(H65/120)*(VLOOKUP($G65,'[1]5. Master Solvent Product List'!$E$5:$Z$25,22,FALSE)))","v":0}]
[null,null,0,null,null,null,null,{"$f":"IF(ISBLANK(G66),\" \",VLOOKUP($G66,'[1]5. Master Solvent Product List'!$E$5:$S$100,4,FALSE))","v":" "},{"$f":"IF(ISBLANK(G66),\" \",VLOOKUP($G66,'[1]5. Master Solvent Product List'!$E$5:$S$100,7,FALSE))","v":" "},{"$f":"IF(ISBLANK(G66),\" \",VLOOKUP($G66,'[1]5. Master Solvent Product List'!$E$5:$S$100,12,FALSE))","v":" "},null,null,0,0,{"$f":"IF(ISBLANK(K66),0,(H66/120)*(VLOOKUP($G66,'[1]5. Master Solvent Product List'!$E$5:$Z$25,20,FALSE)))","v":0},{"$f":"IF(ISBLANK(K66),0,(H66/120)*(VLOOKUP($G66,'[1]5. Master Solvent Product List'!$E$5:$Z$25,22,FALSE)))","v":0}]
[null,null,0,null,null,null,null,{"$f":"IF(ISBLANK(G67),\" \",VLOOKUP($G67,'[1]5. Master Solvent Product List'!$E$5:$S$100,4,FALSE))","v":" "},{"$f":"IF(ISBLANK(G67),\" \",VLOOKUP($G67,'[1]5. Master Solvent Product List'!$E$5:$S$100,7,FALSE))","v":" "},{"$f":"IF(ISBLANK(G67),\" \",VLOOKUP($G67,'[1]5. Master Solvent Product List'!$E$5:$S$100,12,FALSE))","v":" "},null,null,0,0,{"$f":"IF(ISBLANK(K67),0,(H67/120)*(VLOOKUP($G67,'[1]5. Master Solvent Product List'!$E$5:$Z$25,20,FALSE)))","v":0},{"$f":"IF(ISBLANK(K67),0,(H67/120)*(VLOOKUP($G67,'[1]5. Master Solvent Product List'!$E$5:$Z$25,22,FALSE)))","v":0}]
[null,null,0,null,null,null,null,{"$f":"IF(ISBLANK(G68),\" \",VLOOKUP($G68,'[1]5. Master Solvent Product List'!$E$5:$S$100,4,FALSE))","v":" "},{"$f":"IF(ISBLANK(G68),\" \",VLOOKUP($G68,'[1]5. Master Solvent Product List'!$E$5:$S$100,7,FALSE))","v":" "},{"$f":"IF(ISBLANK(G68),\" \",VLOOKUP($G68,'[1]5. Master Solvent Product List'!$E$5:$S$100,12,FALSE))","v":" "},null,null,0,0,{"$f":"IF(ISBLANK(K68),0,(H68/120)*(VLOOKUP($G68,'[1]5. Master Solvent Product List'!$E$5:$Z$25,20,FALSE)))","v":0},{"$f":"IF(ISBLANK(K68),0,(H68/120)*(VLOOKUP($G68,'[1]5. Master Solvent Product List'!$E$5:$Z$25,22,FALSE)))","v":0}]
[null,null,0,null,null,null,null,{"$f":"IF(ISBLANK(G69),\" \",VLOOKUP($G69,'[1]5. Master Solvent Product List'!$E$5:$S$100,4,FALSE))","v":" "},{"$f":"IF(ISBLANK(G69),\" \",VLOOKUP($G69,'[1]5. Master Solvent Product List'!$E$5:$S$100,7,FALSE))","v":" "},{"$f":"IF(ISBLANK(G69),\" \",VLOOKUP($G69,'[1]5. Master Solvent Product List'!$E$5:$S$100,12,FALSE))","v":" "},null,null,0,0,{"$f":"IF(ISBLANK(K69),0,(H69/120)*(VLOOKUP($G69,'[1]5. Master Solvent Product List'!$E$5:$Z$25,20,FALSE)))","v":0},{"$f":"IF(ISBLANK(K69),0,(H69/120)*(VLOOKUP($G69,'[1]5. Master Solvent Product List'!$E$5:$Z$25,22,FALSE)))","v":0}]
[null,null,0,null,null,null,null,{"$f":"IF(ISBLANK(G70),\" \",VLOOKUP($G70,'[1]5. Master Solvent Product List'!$E$5:$S$100,4,FALSE))","v":" "},{"$f":"IF(ISBLANK(G70),\" \",VLOOKUP($G70,'[1]5. Master Solvent Product List'!$E$5:$S$100,7,FALSE))","v":" "},{"$f":"IF(ISBLANK(G70),\" \",VLOOKUP($G70,'[1]5. Master Solvent Product List'!$E$5:$S$100,12,FALSE))","v":" "},null,null,0,0,{"$f":"IF(ISBLANK(K70),0,(H70/120)*(VLOOKUP($G70,'[1]5. Master Solvent Product List'!$E$5:$Z$25,20,FALSE)))","v":0},{"$f":"IF(ISBLANK(K70),0,(H70/120)*(VLOOKUP($G70,'[1]5. Master Solvent Product List'!$E$5:$Z$25,22,FALSE)))","v":0}]
[null,null,0,null,null,null,null,{"$f":"IF(ISBLANK(G71),\" \",VLOOKUP($G71,'[1]5. Master Solvent Product List'!$E$5:$S$100,4,FALSE))","v":" "},{"$f":"IF(ISBLANK(G71),\" \",VLOOKUP($G71,'[1]5. Master Solvent Product List'!$E$5:$S$100,7,FALSE))","v":" "},{"$f":"IF(ISBLANK(G71),\" \",VLOOKUP($G71,'[1]5. Master Solvent Product List'!$E$5:$S$100,12,FALSE))","v":" "},null,null,0,0,{"$f":"IF(ISBLANK(K71),0,(H71/120)*(VLOOKUP($G71,'[1]5. Master Solvent Product List'!$E$5:$Z$25,20,FALSE)))","v":0},{"$f":"IF(ISBLANK(K71),0,(H71/120)*(VLOOKUP($G71,'[1]5. Master Solvent Product List'!$E$5:$Z$25,22,FALSE)))","v":0}]
[null,null,0,null,null,null,null,{"$f":"IF(ISBLANK(G72),\" \",VLOOKUP($G72,'[1]5. Master Solvent Product List'!$E$5:$S$100,4,FALSE))","v":" "},{"$f":"IF(ISBLANK(G72),\" \",VLOOKUP($G72,'[1]5. Master Solvent Product List'!$E$5:$S$100,7,FALSE))","v":" "},{"$f":"IF(ISBLANK(G72),\" \",VLOOKUP($G72,'[1]5. Master Solvent Product List'!$E$5:$S$100,12,FALSE))","v":" "},null,null,0,0,{"$f":"IF(ISBLANK(K72),0,(H72/120)*(VLOOKUP($G72,'[1]5. Master Solvent Product List'!$E$5:$Z$25,20,FALSE)))","v":0},{"$f":"IF(ISBLANK(K72),0,(H72/120)*(VLOOKUP($G72,'[1]5. Master Solvent Product List'!$E$5:$Z$25,22,FALSE)))","v":0}]
[null,null,0,null,null,null,null,{"$f":"IF(ISBLANK(G73),\" \",VLOOKUP($G73,'[1]5. Master Solvent Product List'!$E$5:$S$100,4,FALSE))","v":" "},{"$f":"IF(ISBLANK(G73),\" \",VLOOKUP($G73,'[1]5. Master Solvent Product List'!$E$5:$S$100,7,FALSE))","v":" "},{"$f":"IF(ISBLANK(G73),\" \",VLOOKUP($G73,'[1]5. Master Solvent Product List'!$E$5:$S$100,12,FALSE))","v":" "},null,null,0,0,{"$f":"IF(ISBLANK(K73),0,(H73/120)*(VLOOKUP($G73,'[1]5. Master Solvent Product List'!$E$5:$Z$25,20,FALSE)))","v":0},{"$f":"IF(ISBLANK(K73),0,(H73/120)*(VLOOKUP($G73,'[1]5. Master Solvent Product List'!$E$5:$Z$25,22,FALSE)))","v":0}]
[null,null,0,null,null,null,null,{"$f":"IF(ISBLANK(G74),\" \",VLOOKUP($G74,'[1]5. Master Solvent Product List'!$E$5:$S$100,4,FALSE))","v":" "},{"$f":"IF(ISBLANK(G74),\" \",VLOOKUP($G74,'[1]5. Master Solvent Product List'!$E$5:$S$100,7,FALSE))","v":" "},{"$f":"IF(ISBLANK(G74),\" \",VLOOKUP($G74,'[1]5. Master Solvent Product List'!$E$5:$S$100,12,FALSE))","v":" "},null,null,0,0,{"$f":"IF(ISBLANK(K74),0,(H74/120)*(VLOOKUP($G74,'[1]5. Master Solvent Product List'!$E$5:$Z$25,20,FALSE)))","v":0},{"$f":"IF(ISBLANK(K74),0,(H74/120)*(VLOOKUP($G74,'[1]5. Master Solvent Product List'!$E$5:$Z$25,22,FALSE)))","v":0}]
[null,null,0,null,null,null,null,{"$f":"IF(ISBLANK(G75),\" \",VLOOKUP($G75,'[1]5. Master Solvent Product List'!$E$5:$S$100,4,FALSE))","v":" "},{"$f":"IF(ISBLANK(G75),\" \",VLOOKUP($G75,'[1]5. Master Solvent Product List'!$E$5:$S$100,7,FALSE))","v":" "},{"$f":"IF(ISBLANK(G75),\" \",VLOOKUP($G75,'[1]5. Master Solvent Product List'!$E$5:$S$100,12,FALSE))","v":" "},null,null,0,0,{"$f":"IF(ISBLANK(K75),0,(H75/120)*(VLOOKUP($G75,'[1]5. Master Solvent Product List'!$E$5:$Z$25,20,FALSE)))","v":0},{"$f":"IF(ISBLANK(K75),0,(H75/120)*(VLOOKUP($G75,'[1]5. Master Solvent Product List'!$E$5:$Z$25,22,FALSE)))","v":0}]
[null,null,0,null,null,null,null,{"$f":"IF(ISBLANK(G76),\" \",VLOOKUP($G76,'[1]5. Master Solvent Product List'!$E$5:$S$100,4,FALSE))","v":" "},{"$f":"IF(ISBLANK(G76),\" \",VLOOKUP($G76,'[1]5. Master Solvent Product List'!$E$5:$S$100,7,FALSE))","v":" "},{"$f":"IF(ISBLANK(G76),\" \",VLOOKUP($G76,'[1]5. Master Solvent Product List'!$E$5:$S$100,12,FALSE))","v":" "},null,null,0,0,{"$f":"IF(ISBLANK(K76),0,(H76/120)*(VLOOKUP($G76,'[1]5. Master Solvent Product List'!$E$5:$Z$25,20,FALSE)))","v":0},{"$f":"IF(ISBLANK(K76),0,(H76/120)*(VLOOKUP($G76,'[1]5. Master Solvent Product List'!$E$5:$Z$25,22,FALSE)))","v":0}]
[null,null,0,null,null,null,null,{"$f":"IF(ISBLANK(G77),\" \",VLOOKUP($G77,'[1]5. Master Solvent Product List'!$E$5:$S$100,4,FALSE))","v":" "},{"$f":"IF(ISBLANK(G77),\" \",VLOOKUP($G77,'[1]5. Master Solvent Product List'!$E$5:$S$100,7,FALSE))","v":" "},{"$f":"IF(ISBLANK(G77),\" \",VLOOKUP($G77,'[1]5. Master Solvent Product List'!$E$5:$S$100,12,FALSE))","v":" "},null,null,0,0,{"$f":"IF(ISBLANK(K77),0,(H77/120)*(VLOOKUP($G77,'[1]5. Master Solvent Product List'!$E$5:$Z$25,20,FALSE)))","v":0},{"$f":"IF(ISBLANK(K77),0,(H77/120)*(VLOOKUP($G77,'[1]5. Master Solvent Product List'!$E$5:$Z$25,22,FALSE)))","v":0}]
[null,null,0,null,null,null,null,{"$f":"IF(ISBLANK(G78),\" \",VLOOKUP($G78,'[1]5. Master Solvent Product List'!$E$5:$S$100,4,FALSE))","v":" "},{"$f":"IF(ISBLANK(G78),\" \",VLOOKUP($G78,'[1]5. Master Solvent Product List'!$E$5:$S$100,7,FALSE))","v":" "},{"$f":"IF(ISBLANK(G78),\" \",VLOOKUP($G78,'[1]5. Master Solvent Product List'!$E$5:$S$100,12,FALSE))","v":" "},null,null,0,0,{"$f":"IF(ISBLANK(K78),0,(H78/120)*(VLOOKUP($G78,'[1]5. Master Solvent Product List'!$E$5:$Z$25,20,FALSE)))","v":0},{"$f":"IF(ISBLANK(K78),0,(H78/120)*(VLOOKUP($G78,'[1]5. Master Solvent Product List'!$E$5:$Z$25,22,FALSE)))","v":0}]
[null,null,0,null,null,null,null,{"$f":"IF(ISBLANK(G79),\" \",VLOOKUP($G79,'[1]5. Master Solvent Product List'!$E$5:$S$100,4,FALSE))","v":" "},{"$f":"IF(ISBLANK(G79),\" \",VLOOKUP($G79,'[1]5. Master Solvent Product List'!$E$5:$S$100,7,FALSE))","v":" "},{"$f":"IF(ISBLANK(G79),\" \",VLOOKUP($G79,'[1]5. Master Solvent Product List'!$E$5:$S$100,12,FALSE))","v":" "},null,null,0,0,{"$f":"IF(ISBLANK(K79),0,(H79/120)*(VLOOKUP($G79,'[1]5. Master Solvent Product List'!$E$5:$Z$25,20,FALSE)))","v":0},{"$f":"IF(ISBLANK(K79),0,(H79/120)*(VLOOKUP($G79,'[1]5. Master Solvent Product List'!$E$5:$Z$25,22,FALSE)))","v":0}]
[null,null,0,null,null,null,null,{"$f":"IF(ISBLANK(G80),\" \",VLOOKUP($G80,'[1]5. Master Solvent Product List'!$E$5:$S$100,4,FALSE))","v":" "},{"$f":"IF(ISBLANK(G80),\" \",VLOOKUP($G80,'[1]5. Master Solvent Product List'!$E$5:$S$100,7,FALSE))","v":" "},{"$f":"IF(ISBLANK(G80),\" \",VLOOKUP($G80,'[1]5. Master Solvent Product List'!$E$5:$S$100,12,FALSE))","v":" "},null,null,0,0,{"$f":"IF(ISBLANK(K80),0,(H80/120)*(VLOOKUP($G80,'[1]5. Master Solvent Product List'!$E$5:$Z$25,20,FALSE)))","v":0},{"$f":"IF(ISBLANK(K80),0,(H80/120)*(VLOOKUP($G80,'[1]5. Master Solvent Product List'!$E$5:$Z$25,22,FALSE)))","v":0}]
[null,null,0,null,null,null,null,{"$f":"IF(ISBLANK(G81),\" \",VLOOKUP($G81,'[1]5. Master Solvent Product List'!$E$5:$S$100,4,FALSE))","v":" "},{"$f":"IF(ISBLANK(G81),\" \",VLOOKUP($G81,'[1]5. Master Solvent Product List'!$E$5:$S$100,7,FALSE))","v":" "},{"$f":"IF(ISBLANK(G81),\" \",VLOOKUP($G81,'[1]5. Master Solvent Product List'!$E$5:$S$100,12,FALSE))","v":" "},null,null,{"$f":"IF(ISBLANK(K81),0,K81-L81)","v":0},{"$f":"IF(ISBLANK(K81),0,(H81/120)*M81)","v":0},{"$f":"IF(ISBLANK(K81),0,(H81/120)*(VLOOKUP($G81,'[1]5. Master Solvent Product List'!$E$5:$Z$25,20,FALSE)))","v":0},{"$f":"IF(ISBLANK(K81),0,(H81/120)*(VLOOKUP($G81,'[1]5. Master Solvent Product List'!$E$5:$Z$25,22,FALSE)))","v":0}]
[]
[]
[null,null,null,null,null,null,null,null,null,"Total Monthly Emissions"]
[null,null,null,null,null,null,null,null,null,"GALLONS USED","All VOCs","n-butanol","Xylenes"]
[null,null,null,null,null,null,null,null,"Pounds",0,0,0,0]
[null,null,null,null,null,null,null,null,"Tons",0,0,0,0]

{"sheet":"6. APCD Limits","index":5,"n_rows":137,"n_cols":6,"rows_kept":137,"cut":false,"hidden":false,"merged":[[56,1,61,1],[56,5,61,5],[35,5,47,5],[48,5,52,5],[53,5,55,5]]}
[]
[]
[]
[]
[]
[]
[]
[]
["Source:  San Diego Air Pollution Control District Rule 67.21 Effective 11/14/2008"]
[null,"SDAPCD Rule 67.21","Compound Category Name","Product Category","VOC Limit (g/l)","Comment"]
[null,"(d)(1)(i) General Adhesive Materials, (A) Architectural Products",{"$f":"CONCATENATE(B11,\", \",D11)","v":"(d)(1)(i) General Adhesive Materials, (A) Architectural Products, Architectural sealant"},"Architectural sealant",250]
[null,{"$f":"$B$11","v":"(d)(1)(i) General Adhesive Materials, (A) Architectural Products"},"(d)(1)(i) General Adhesive Materials, (A) Architectural Products, Architectural sealant primer for non-porous materials","Architectural sealant primer for non-porous materials",250]
[null,{"$f":"$B$11","v":"(d)(1)(i) General Adhesive Materials, (A) Architectural Products"},"(d)(1)(i) General Adhesive Materials, (A) Architectural Products, Architectural sealant primer for porous materials","Architectural sealant primer for porous materials",775]
[null,"(d)(1)(i) General Adhesive Materials, (A) Architectural Products","(d)(1)(i) General Adhesive Materials, (A) Architectural Products, Ceramic tile installation adhesive","Ceramic tile installation adhesive",65]
[null,"(d)(1)(i) General Adhesive Materials, (A) Architectural Products","(d)(1)(i) General Adhesive Materials, (A) Architectural Products, Cove base installation adhesive","Cove base installation adhesive",50]
[null,"(d)(1)(i) General Adhesive Materials, (A) Architectural Products","(d)(1)(i) General Adhesive Materials, (A) Architectural Products, Flooring adhesives:Indoor carpet or carpet pad adhesive","Flooring adhesives:Indoor carpet or carpet pad adhesive",50]
[null,"(d)(1)(i) General Adhesive Materials, (A) Architectural Products","(d)(1)(i) General Adhesive Materials, (A) Architectural Products, Flooring adhesives:Rubber flooring adhesive","Flooring adhesives:Rubber flooring adhesive",60]
[null,"(d)(1)(i) General Adhesive Materials, (A) Architectural Products","(d)(1)(i) General Adhesive Materials, (A) Architectural Products, Flooring adhesives:Subfloor adhesive","Flooring adhesives:Subfloor adhesive",50]
[null,"(d)(1)(i) General Adhesive Materials, (A) Architectural Products","(d)(1)(i) General Adhesive Materials, (A) Architectural Products, Flooring adhesives:VCT and asphalt tile adhesive","Flooring adhesives:VCT and asphalt tile adhesive",50]
[null,"(d)(1)(i) General Adhesive Materials, (A) Architectural Products","(d)(1)(i) General Adhesive Materials, (A) Architectural Products, Flooring adhesives:Wood flooring adhesive","Flooring adhesives:Wood flooring adhesive",100]
[null,"(d)(1)(i) General Adhesive Materials, (A) Architectural Products","(d)(1)(i) General Adhesive Materials, (A) Architectural Products, Flooring adhesives:Other floor covering adhesive","Flooring adhesives:Other floor covering adhesive",150]
[null,"(d)(1)(i) General Adhesive Materials, (A) Architectural Products","(d)(1)(i) General Adhesive Materials, (A) Architectural Products, Multipurpose construction installation/repair adhesive","Multipurpose construction installation/repair adhesive",70]
[null,"(d)(1)(i) General Adhesive Materials, (A) Architectural Products","(d)(1)(i) General Adhesive Materials, (A) Architectural Products, Non-membrane roof installation/repair adhesive/sealant","Non-membrane roof installation/repair adhesive/sealant",300]
[null,"(d)(1)(i) General Adhesive Materials, (A) Architectural Products","(d)(1)(i) General Adhesive Materials, (A) Architectural Products, Perimeter bonding adhesive","Perimeter bonding adhesive",660]
[null,"(d)(1)(i) General Adhesive Materials, (A) Architectural Products","(d)(1)(i) General Adhesive Materials, (A) Architectural Products, Roadway sealant","Roadway sealant",250]
[null,"(d)(1)(i) General Adhesive Materials, (A) Architectural Products","(d)(1)(i) General Adhesive Materials, (A) Architectural Products, Single-ply roof membrane installation/repair adhesive/primer","Single-ply roof membrane installation/repair adhesive/primer",250]
[null,"(d)(1)(i) General Adhesive Materials, (A) Architectural Products","(d)(1)(i) General Adhesive Materials, (A) Architectural Products, Single-ply roof membrane sealant","Single-ply roof membrane sealant",450]
[null,"(d)(1)(i) General Adhesive Materials, (A) Architectural Products","(d)(1)(i) General Adhesive Materials, (A) Architectural Products, Structural glazing adhesive","Structural glazing adhesive",100]
[null,"(d)(1)(i) General Adhesive Materials, (A) Architectural Products","(d)(1)(i) General Adhesive Materials, (A) Architectural Products, Structural wood member adhesive","Structural wood member adhesive",140]
[null,"(d)(1)(i) General Adhesive Materials, (A) Architectural Products","(d)(1)(i) General Adhesive Materials, (A) Architectural Products, Traffic marking tape adhesive primer","Traffic marking tape adhesive primer",150]
[null,"(d)(1)(i) General Adhesive Materials, (B) Plastic Welding Products","(d)(1)(i) General Adhesive Materials, (B) Plastic Welding Products, ABS welding adhesive","ABS welding adhesive",400,"Applies to plastic welding products, inlcuding aerosols"]
[null,{"$f":"$B$31","v":"(d)(1)(i) General Adhesive Materials, (B) Plastic Welding Products"},"(d)(1)(i) General Adhesive Materials, (B) Plastic Welding Products, CPVC welding adhesive","CPVC welding adhesive",490]
[null,{"$f":"$B$31","v":"(d)(1)(i) General Adhesive Materials, (B) Plastic Welding Products"},"(d)(1)(i) General Adhesive Materials, (B) Plastic Welding Products, PVC welding adhesive","PVC welding adhesive",510]
[null,{"$f":"$B$31","v":"(d)(1)(i) General Adhesive Materials, (B) Plastic Welding Products"},"(d)(1)(i) General Adhesive Materials, (B) Plastic Welding Products, Plastic cement welding adhesive primer","Plastic cement welding adhesive primer",650]
[null,{"$f":"$B$31","v":"(d)(1)(i) General Adhesive Materials, (B) Plastic Welding Products"},"(d)(1)(i) General Adhesive Materials, (B) Plastic Welding Products, Other plastic cement welding adhesives","Other plastic cement welding adhesives",510]
[null,"(d)(1)(ii) Specialty Adhesive Materials","(d)(1)(ii) Specialty Adhesive Materials, Automotive glass adhesive primer","Automotive glass adhesive primer",700,"If more than one VOC limit provided in Subsections (d)(1)(i) or (d)(1)(ii) is applicable, the most stringent VOC limit shall apply."]
[null,{"$f":"$B$36","v":"(d)(1)(ii) Specialty Adhesive Materials"},"(d)(1)(ii) Specialty Adhesive Materials, Computer diskette jacket manufacturing adhesive","Computer diskette jacket manufacturing adhesive",850]
[null,{"$f":"$B$36","v":"(d)(1)(ii) Specialty Adhesive Materials"},"(d)(1)(ii) Specialty Adhesive Materials, Contact Adhesive - General","Contact Adhesive - General",80]
[null,"(d)(1)(ii) Specialty Adhesive Materials","(d)(1)(ii) Specialty Adhesive Materials, Contact Adhesive - Special","Contact Adhesive - Special",250]
[null,"(d)(1)(ii) Specialty Adhesive Materials","(d)(1)(ii) Specialty Adhesive Materials, Elastomeric adhesive","Elastomeric adhesive",750]
[null,"(d)(1)(ii) Specialty Adhesive Materials","(d)(1)(ii) Specialty Adhesive Materials, Marine deck sealant/primer","Marine deck sealant/primer",760]
[null,"(d)(1)(ii) Specialty Adhesive Materials","(d)(1)(ii) Specialty Adhesive Materials, Metal to elastomer molding or casting adhesive","Metal to elastomer molding or casting adhesive",850]
[null,"(d)(1)(ii) Specialty Adhesive Materials","(d)(1)(ii) Specialty Adhesive Materials, Natural gas pipeline tape adhesive primer","Natural gas pipeline tape adhesive primer",600]
[null,"(d)(1)(ii) Specialty Adhesive Materials","(d)(1)(ii) Specialty Adhesive Materials, Sheet rubber lining installation adhesive","Sheet rubber lining installation adhesive",850]
[null,"(d)(1)(ii) Specialty Adhesive Materials","(d)(1)(ii) Specialty Adhesive Materials, Thin metal laminating adhesive","Thin metal laminating adhesive",780]
[null,"(d)(1)(ii) Specialty Adhesive Materials","(d)(1)(ii) Specialty Adhesive Materials, Tire retread adhesive","Tire retread adhesive",100]
[null,"(d)(1)(ii) Specialty Adhesive Materials","(d)(1)(ii) Specialty Adhesive Materials, Top and Trim adhesive","Top and Trim adhesive",540]
[null,"(d)(1)(ii) Specialty Adhesive Materials","(d)(1)(ii) Specialty Adhesive Materials, Waterproof resorcinol glue","Waterproof resorcinol glue",170]
[null,"(d)(1)(iii) Substrate Specific Adhesive","(d)(1)(iii) Substrate Specific Adhesive, Fiberglass","Fiberglass",80,"If an adhesive is not listed in Subsection (d)(1)(i) or (d)(1)(ii), the VOC limits in (d)(1)(iii) are applicable on a substrate-specific basis. "]
[null,{"$f":"$B$49","v":"(d)(1)(iii) Substrate Specific Adhesive"},"(d)(1)(iii) Substrate Specific Adhesive, Metal","Metal",30]
[null,{"$f":"$B$49","v":"(d)(1)(iii) Substrate Specific Adhesive"},"(d)(1)(iii) Substrate Specific Adhesive, Porous material (except wood)","Porous material (except wood)",50]
[null,{"$f":"$B$49","v":"(d)(1)(iii) Substrate Specific Adhesive"},"(d)(1)(iii) Substrate Specific Adhesive, Wood","Wood",30]
[null,{"$f":"$B$49","v":"(d)(1)(iii) Substrate Specific Adhesive"},"(d)(1)(iii) Substrate Specific Adhesive, Other substrates","Other substrates",250]
[null,"EXEMPT FROM RULE 67.21","EXEMPT FROM RULE 67.21, < 20 g/l VOC, FOR USGAE RECORDS ONLY","< 20 g/l VOC, FOR USGAE RECORDS ONLY",20]
[null,{"$f":"$B$54","v":"EXEMPT FROM RULE 67.21"},"EXEMPT FROM RULE 67.21, Container < 16 oz/1 lb, FOR USAGE RECORDS ONLY","Container < 16 oz/1 lb, FOR USAGE RECORDS ONLY","X"]
[null,{"$f":"$B$54","v":"EXEMPT FROM RULE 67.21"},"EXEMPT FROM RULE 67.21, Aerosol","Aerosol","X"]
[null,"(d)(1)(iii) Substrate Specific Adhesive",null,"Adhesive Primer",250]
[null,null,null,"Sealant",420]
[null,null,null,"Sealant primer",750]
[]
[]
[]
[]
[]
[]
[]
[]
[]
[]
[]
[]
[]
[]
["The VOC limits and catergories shown above are provided for reference only. The user is repsonsible for verifying the accuracy of the information in the current version of SDAPCD Rule 67.21  "]
[]
[]
[]
[]
[]
[]
[]
[]
[]
[]
[]
[]
[]
[]
[]
[]
[]
[]
[]
[]
[]
[]
[]
[]
[]
[]
[]
[]
[]
[]
[]
[]
[]
[]
[]
[]
[]
[]
[]
[]
[]
[]
[]
[]
[]
[]
[]
[]
[]
[]
[]
[]
[]
[]
[]
[]
[]
[null,"Column1"]
[null,{"$f":"B11","v":"(d)(1)(i) General Adhesive Materials, (A) Architectural Products"}]
[null,{"$f":"B31","v":"(d)(1)(i) General Adhesive Materials, (B) Plastic Welding Products"}]
[null,{"$f":"B36","v":"(d)(1)(ii) Specialty Adhesive Materials"}]
[null,{"$f":"B49","v":"(d)(1)(iii) Substrate Specific Adhesive"}]
[null,{"$f":"B54","v":"EXEMPT FROM RULE 67.21"}]

{"sheet":"Drop Down List 2","index":6,"n_rows":272,"n_cols":11,"rows_kept":272,"cut":false,"hidden":true,"merged":[]}
[]
[]
[]
["Manufacturer's Name",null,"VOC Units",null,"Application Method",null,"Month",null,null,null,"VOC Control for Equipment Cleaning Solvents"]
["American Safety Technologies",null,"lb/gal",null,"Brush/Roll",null,"Jan",null,null,null,"Enclosed Parts Cleaning: a system is used that totally encloses the component parts being cleaned during the washing, rinsing, and draining process, as described in 67.21(d)(3)(vi)"]
["Ameron Protective Coatings",null,"g/l",null,"Airless",null,"Feb",null,null,null,"Contained Flushing: cleaning solvent is flushed or rinsed through equipment in a contained manner as described in 67.21(d)(3)(iv)"]
["Belzona Inc",null,null,null,"HVLP",null,"Mar",null,null,null,"Closed Container: equipment or parts are cleaned in a container which is only opened when being accessesed for adding, cleaning, or removing application equipment and parts are allowed to drain or drip prior to removal, as described in 67.21(d)(3)(v)"]
["Brenntag Pacific",null,null,null,"Conventional",null,"Apr"]
["Carboline",null,"Temperature Units",null,null,null,"May"]
["Devoe Coatings",null,"F",null,null,null,"Jun"]
["Euronavy",null,"C",null,null,null,"Jul"]
["Glidden",null,null,null,null,null,"Aug"]
["Hempel",null,null,null,null,null,"Sep",null,null,null,"Government Installations"]
["International Paint (USA) Inc.",null,null,null,null,null,"Oct",null,null,null,"AMPHIB"]
["Pervo Paint",null,null,null,null,null,"Nov",null,null,null,"MCBCP"]
["PPG Industries INC.",null,null,null,null,null,"Dec",null,null,null,"NBC"]
["Sherwin Williams (Proline Paints)",null,null,null,"Control Method",null,null,null,null,null,"NBPL"]
["Speciality Coatings & Chemicals Inc.",null,null,null,"Shrouding",null,null,null,null,null,"NBSD"]
["Weatherman Products Inc.",null,"Prime Contractor",null,"Inside Tank "]
["Fiber Materials Inc.",null,"AMEE BAY",null,"Inside Ship"]
["Ellis Paint Co.",null,"AMSEC LLC",null,"None",null,"Year"]
[null,null,"BAE SYSTEMS",null,null,null,2013,null,null,null,"Hiring Agency"]
[null,null,"BAY CITY MARINE",null,null,null,2014,null,null,null,"AIRPAC"]
[null,null,"BIW",null,null,null,2015,null,null,null,"CHOUEST TUGS"]
[null,null,"C & N UNIVERSE INC",null,null,null,null,null,null,null,"FISC"]
[null,null,"CIS ",null,null,null,null,null,null,null,"MSC"]
[null,null,"CMSD",null,null,null,null,null,null,null,"NAVAIR"]
[null,null,"CROWLEY",null,null,null,null,null,null,null,"NAVAL SURFACE WARFARE CENTER"]
[null,null,"DELPHINUS",null,null,null,null,null,null,null,"NAVAL SURFACE WARFARE CENTER CORONA"]
["VESSELS",null,"EPSILON SYSTEMS",null,null,null,null,null,null,null,"NAVSEA  PHILA"]
["80CM0310",null,"FEDERAL MARINE & DEFENSE SERVICES",null,"Density Units",null,null,null,null,null,"NAVSSES"]
["80DM302",null,"FRASER'S BOILER SERVICE",null,"Specific Gravity",null,null,null,null,null,"NAVSUP"]
["80IM302",null,"GENERAL DYNAMICS NASSCO",null,null,null,null,null,null,null,"NORFOLK NAVAL SHIPYARD"]
["88BM0302",null,"GRIFFIN TECHNOLOGY",null,"Lbs/Gallon",null,null,null,null,null,"PEARL HARBOR NAVAL SHIPYARD"]
["88BM067",null,"GULF COPPER SHIP REPAIR",null,null,null,null,null,null,null,"PORTSMOUTH NAVAL SHIPYARD"]
["88CFPM0301",null,"INTEGRATED MARINE SERVICES",null,null,null,null,null,null,null,"PUGET SOUND NAVAL SHIPYARD"]
["88CFPM0302",null,"L3/ PACORD",null,null,null,null,null,null,null,"SPAWAR"]
["88CFPM0617",null,"LMCO",null,null,null,null,null,null,null,"SWRMC"]
["88CFPM116",null,"LOCKHEED MARTIN",null,null,null,null,null,null,null,"USCG"]
["88CM0311",null,"MARINE AND RESTAURANT FABRICATORS, INC"]
["88IM0306",null,"MILLER MARINE"]
["88WT0302",null,"MRF"]
["88WT0303",null,"NAVAIR"]
["88WT0304",null,"NEVWEST"]
["ALAN SHEPARD   T-AKE-3",null,"NEWPORT NEWS"]
["ALBUQUERQUE    SSN-706",null,"NGNN "]
["AMELIA EARHART    T-AKE-6",null,"NORTHRUP-GRUMMAN"]
["ANCHORAGE LPD-23",null,"OCEANEERING"]
["ANTIETAM    CG-54",null,"PACSHIP"]
["APACHE    T-ATF-172",null,"PAIGE FLOOR COVERING"]
["APL-15",null,"PCE"]
["APL-18",null,"PHOENIX GROUP OF VA"]
["APL-2",null,"PMI"]
["APL-5",null,"PRISM MARITIME"]
["APL-65",null,"PSRF"]
["ARCO ARDM-5 ",null,"Q.E.D. SYSTEMS, INC "]
["ARCTIC    T-AOE-8",null,"SBSB"]
["ASHEVILLE    SSN-758",null,"SERCO"]
["BENFOLD    DDG-65",null,"SOUTH BAY BOILER REPAIR"]
["BERTHOLF USCGC     WMSL-750",null,"SOUTH COAST WELDING (BAE)"]
["BIG HORN    T-AO-198",null,"SUB"]
["BOB HOPE    TAKR-300",null,"SWRMC"]
["BONHOMME RICHARD    LHD-6",null,"TINOSA"]
["BOUTWELL USCGC    WHEC-719",null,"UNIVERSAL STEEL FAB.,INC"]
["BOXER    LHD-4",null,"VSE"]
["BRIDGE    T-AOE-10",null,"VT MILCOM"]
["BUNKER HILL    CG-52",null,"YYK"]
["BYRD    T-AKE-4"]
["CAPE ST GEORGE    CG-71  "]
["CARL BRASHEAR    T-AKE-7"]
["CARL VINSON    CVN-70"]
["CATAWBA    T-ATF 168"]
["CHAFEE    DDG-90"]
["CHAMPION    MCM-4"]
["CHANCELLORSVILLE    CG-62"]
["CHARLES DREW    T-AKE-10"]
["CHASE USCGC    WHEC-718"]
["CHIEF    MCM-14"]
["CHOSIN    CG-65"]
["CHUNG-HOON    DDG-93"]
["CLEVELAND    LPD-7"]
["COMFORT    T-AH-20"]
["COMSTOCK    LSD-45"]
["CROMMELIN    FFG-37"]
["CURTISS    T-AVB-4"]
["CURTS    FFG-38"]
["DECATUR    DDG-73"]
["DENVER    LPD-9"]
["DEVASTATOR    MCM-6"]
["DEVIL RAY  "]
["DEWEY    DDG-105"]
["DIEHL    T-AO-193"]
["DIVE MODULE DSM-8"]
["Divers Weld Barge"]
["DUBUQUE    LPD-8"]
["ERICSSON    T-AO-194"]
["ESSEX    LHD-2"]
["FLINT    T-AE-32"]
["FORD    FFG-54"]
["FORT WORTH  LCS-3"]
["FRANK CABLE    AS-40"]
["FREEDOM    LCS-1"]
["GARY    FFG-51"]
["GERMANTOWN    LSD-42"]
["GRAPPLE    T-ARS-53"]
["GRASP    T-ARS-51"]
["GREEN BAY    LPD-20"]
["GRIDLEY    DDG-101"]
["GRUMMAN    T-AO-195"]
["GUADALUPE    T-AO-200"]
["HALSEY    DDG-97"]
["HAMILTON USCGC    WHEC-715"]
["HAMPTON    SSN-767"]
["HARPERS FERRY    LSD-49"]
["HENRY J. KAISER    T-AO-187"]
["HIGGINS    DDG-76"]
["HOPPER    DDG-70"]
["HOWARD    DDG-83"]
["INDEPENDENCE    LCS-2"]
["INGRAHAM    FFG-61"]
["INLS    80CM-0307"]
["INLS    80CM-0309"]
["INLS    80IM-0305"]
["INLS    88BM-0616"]
["INLS    88CFPM-0616"]
["Jacqueline    2"]
["JARRETT    FFG-33"]
["JEFFERSON CITY    SSN-759"]
["JOHN PAUL JONES    DDG-53"]
["JOSHUA HUMPHREYS    T-AO-188"]
["KAIMIMOANA    R-333"]
["KANAWHA    T-AO-196"]
["KIDD    DDG-100"]
["KISKA    T-AE-35"]
["LAKE CHAMPLAIN    CG-57"]
["LAKE ERIE    CG-70"]
["LAND    AS 39"]
["LARAMIE    T-AO-203"]
["LCAC   10"]
["LCAC   14"]
["LCAC   16"]
["LCAC   17"]
["LCAC   21"]
["LCAC   23"]
["LCAC   24"]
["LCAC   29"]
["LCAC   30"]
["LCAC   31"]
["LCAC   32"]
["LCAC   33"]
["LCAC   40"]
["LCAC   42"]
["LCAC   43"]
["LCAC   44"]
["LCAC   45"]
["LCAC   47"]
["LCAC   48"]
["LCAC   52"]
["LCAC   56"]
["LCAC   57"]
["LCAC   58"]
["LCAC   59"]
["LCAC   62"]
["LCAC   63"]
["LCAC   64"]
["LCAC   65"]
["LCAC   72"]
["LCAC   73"]
["LCAC   74"]
["LCAC   75"]
["LCAC   76"]
["LCAC   79"]
["LCAC   8"]
["LCAC   80"]
["LCAC   81"]
["LCAC   82"]
["LCAC   9"]
["LCAC   90"]
["LCU    1627"]
["LCU    1629"]
["LCU    1631"]
["LCU    1635"]
["LCU    1648"]
["LCU    1665"]
["LCU    1929"]
["LCU    1930"]
["LCU    1933"]
["LCU    1980"]
["LENTHALL    T-AO-189"]
["LEWIS AND CLARK    T-AKE-1"]
["MAKIN ISLAND    LHD-8"]
["MATTHEW PERRY    T-AKE-9"]
["MCCAMPBELL    DDG-85   "]
["MCCLUSKY    FFG-41"]
["MERCY    T-AH 19"]
["MILIUS    DDG-69  "]
["MOBILE BAY    CG-53"]
["MOMSEN    DDG-92"]
["MONSOON    PC-4"]
["MOUNT WHITNEY    LCC/JCC 20"]
["MUSTIN    DDG-89"]
["NAVAJO    T-ATF-169"]
["NEW ORLEANS    LPD-18"]
["NIMITZ    CVN-68"]
["OGDEN    LPD-5"]
["O'KANE    DDG-60"]
["PATUXENT    T-AO-201"]
["PEARL HARBOR    LSD-52"]
["PEARY    T-AKE-5"]
["PECOS    T-AO-197"]
["PELELIU    LHA-5"]
["PETREL WPB 87350"]
["PINCKNEY    DDG-91   "]
["PIONEER    MCM-9"]
["PORT ROYAL    CG-73"]
["PREBLE    DDG-88"]
["PRINCETON    CG-59"]
["RAINIER    T-AOE 7"]
["RANGE SUPPORT CRAFT  rsc-1"]
["RAPPAHANNOCK    T-AO-204"]
["RENTZ    FFG-46"]
["REUBEN JAMES    FFG-57"]
["RODNEY M DAVIS    FFG-60"]
["RONALD REAGAN    CVN-76"]
["RUSHMORE    LSD-47"]
["RUSSELL    DDG-59"]
["RV    NEW HORIZON"]
["SACAGAWEA    T-AKE-2"]
["SAFEGUARD    T-ARS 50"]
["SALVOR    T-ARS-52"]
["SAMPSON    DDG-102"]
["SAN DIEGO    LPD-22"]
["SAN FRANCISCO    SSN-711"]
["SEA FIGHTER    FSF-1"]
["SENTRY    MCM-3"]
["SHASTA    T-AE-33"]
["SHERMAN USCGC    WHEC-720"]
["SHILOH    CG-67"]
["SHOUP    DDG-86"]
["SIOUX    T-ATF-171"]
["SPRUANCE    DDG-111"]
["STERETT    DDG-104"]
["STOCKDALE    DDG-106"]
["SUPPLY    T-AOE-6"]
["SWAMP FOX TWR-821"]
["TARAWA    LHA-1"]
["THACH    FFG-43"]
["TIPPECANOE    T-AO-199"]
["TOPEKA   SSN-754"]
["VANDERGRIFT    FFG-48"]
["WALLY SCHIRRA    T-AKE-8"]
["WARRIOR    MCM-10"]
["WASHINGTON CHAMBERS    T-AKE-11"]
["WATERS    T-AGS-45"]
["WAYKNE E MEYER    DDG-108"]
["WILIAM P. LAWRENCE    DDG-110"]
["YC-1473"]
["YFNB-19 "]
["YON-327"]
["YR-93"]
["YRBM-20"]
["YRBM-26"]
["YRBM-29"]
["YRBM-38"]
["YRBM-39"]
["YRBM-44"]
["YRBM-51"]
["YRBM-55"]
["YRBM-65"]
["YUKON    T-AO-202"]
["ZEPHYR    PC-8"]
["ZEUS    T-ARC-7"]

{"sheet":"Drop Down list 1","index":7,"n_rows":8,"n_cols":2,"rows_kept":8,"cut":false,"hidden":true,"merged":[]}
[]
[]
[null,"Government Installations"]
[null,"AMPHIB"]
[null,"MCBCP"]
[null,"NBC"]
[null,"NBPL"]
[null,"NBSD"]