{"text_format":"1","workbook":"xlsx","n_sheets":8,"sheets":["1. INSTRUCTIONS","2. Master Adhesive List","3. Master Solvent List","4. Adhesive Reporting Form","5. Solvent Reprting Form","6. APCD Limits","Drop Down List 2","Drop Down list 1"],"not_rendered":{"charts":0,"images":1,"macros":1,"external_links":2,"defined_names":43,"comments":1,"pivot_tables":0},"unopened":[],"bounds":{"document_bytes":16777216,"sheet_cells":100000,"rows_first":2000,"rows_last":500,"rows_between":2000,"halvings":0,"cell_chars":16384,"cell_head_chars":4096},"cells_cut":0,"cells_raw":0,"read":"whole","date_system":"1900"}

{"sheet":"1. INSTRUCTIONS","index":0,"n_rows":69,"n_cols":11,"rows_kept":69,"cut":false,"hidden":false,"merged":[[5,1,5,9],[6,1,6,9],[7,7,7,9],[8,1,8,5],[8,7,8,9],[43,0,43,3],[43,4,43,5],[43,6,43,9],[43,10,43,12],[9,1,9,5],[9,7,9,9],[42,0,42,3],[42,4,42,5],[42,6,42,9],[40,0,40,3],[40,4,40,5],[40,6,40,9],[38,0,38,3],[38,4,38,5],[38,6,38,9],[13,1,13,15],[41,0,41,3],[41,4,41,5],[41,6,41,9],[41,10,41,12],[42,10,42,12],[39,0,39,3],[39,4,39,5],[39,6,39,9],[39,10,39,12],[40,10,40,12],[18,1,18,15],[22,1,22,15],[25,1,25,15],[7,1,7,5],[38,10,38,12],[30,1,30,15],[14,1,14,15],[32,1,32,15],[15,1,15,15]]}
[]
[]
[null,null,null,null,"INSTRUCTIONS FOR COMPLETION OF THE ADHESIVE MONTHLY REPORTING FORM"]
[]
["1)  Provide Identifying Information About the Company Applying Adhesives:"]
["Company Name"]
["Address"]
["City, zip code",null,null,null,null,null,"Phone"]
["Reported by: Name/Title",null,null,null,null,null,"E-Mail"]
[null,null,null,null,null,null,"Report Date"]
[]
[]
["A. Overview of Reporting Requirement"]
["1)","Any company that uses/applies adhesives or performs associated surface preparation, equipment cleanup, or stripping at naval or contractor  facilities is required to submit monthly reports of materials used."]
["2) ","Users of adhesive products are responsible for verifying that all adhesive products comply with the San Diego Air Pollution Control District's Rule 67.21.  User must indicate the product category applicable to each product in their monthly report."]
{"$rows_left_out":55}
{"sheet":"2. Master Adhesive List","index":1,"n_rows":62,"n_cols":8,"rows_kept":62,"cut":false,"hidden":false,"merged":[]}
[]
[]
[]
[]
[]
[]
[]
[]
["MASTER PRODUCT LIST - ADHESIVES"]
[]
["Adhesive Product Name","Product Manufacturer","VOC Content of Product (as applied)","Unit","Surface Applied To (Substrate)","Product Classification from APCD Rule 67.21","Product VOC in g/l","APCD VOC Limit"]
[2033,"Taylor",0,"grams/liter","X","< 20 g/l VOC, FOR USGAE RECORDS ONLY",0,{"$f":"VLOOKUP(F12,'[2]6. APCD Limits'!$D$11:$E$62,2,FALSE)","v":20}]
[4099,"Parabond",1,"grams/liter","X","< 20 g/l VOC, FOR USGAE RECORDS ONLY",1,{"$f":"VLOOKUP(F13,'[2]6. APCD Limits'!$D$11:$E$62,2,FALSE)","v":20}]
[847,"3M",0,"grams/liter","X","< 20 g/l VOC, FOR USGAE RECORDS ONLY",0,{"$f":"VLOOKUP(F14,'[2]6. APCD Limits'!$D$11:$E$62,2,FALSE)","v":20}]
["1290 Ultra Lt Underlayment","EPMAR",0,"grams/liter","X","< 20 g/l VOC, FOR USGAE RECORDS ONLY",0,{"$f":"VLOOKUP(F15,'[2]6. APCD Limits'!$D$11:$E$62,2,FALSE)","v":20}]
{"$rows_left_out":48}
{"sheet":"3. Master Solvent List","index":2,"n_rows":107,"n_cols":26,"rows_kept":107,"cut":false,"hidden":false,"merged":[]}
[]
[]
[]
[]
[]
[]
[]
[]
["MASTER PRODUCT LIST - SOLVENTS"]
[]
["Solvent Used for:","Solvent Manufacturer Name","Solvent Name","Product ID","Composite Solvent Name","VOC Content","Unit","g/liter ","VOC Limit (g/L)","Meets VOC Limit?","Vapor Pressure (mm/hg)","Vapor Pressure Limit","Meets Vapor Pressure Limit?","Initial Boiling Point","Boiling Point Unit","C ","IBP Limit (Degrees C)","Meets IBP Limit?","Complies with Numeric Limits?","Alt Compliance Needed?","Alternate Method of Compliance                                                     (VOC reduction measures must be used for any equipment cleaning solvent NOT meeting numeric limits; see SDAPCD Rule 67.18 (D)(3).  If highlighted Orange, indicate method to","Solvent Density (lbs/gal)","n-butanol (%)","n-butanol content (lbs/gal)","Mixed Xylenes (%)","Mixed Xylenes content (lbs/gal)"]
["Equipment Cleaning","Brenntag Pacific","40/60 MEK/MIBK Wipe Solvent",628893,{"$f":"IF(ISBLANK(B12),\" \",CONCATENATE($A12,\": \",$B12,\" \",$C12,\" \",$D12))","v":"Equipment Cleaning: Brenntag Pacific 40/60 MEK/MIBK Wipe Solvent 628893"},802,"g/l",{"$f":"IF($G12 = \"lb/gal\",($F12*120),$F12)","v":802},{"$f":"IF(H12>1,VLOOKUP($A12,'[1]Marine Coating Limits'!$I$3:$L$4,2,FALSE),0)","v":200},{"$f":"IF(H12>0.001,IF($H12>$I12,0,1),0)","v":0},41.9,{"$f":"IF(K12>0.01,VLOOKUP(A12,'[1]Marine Coating Limits'!$I$3:$L$4,4,FALSE),0)","v":20},{"$f":"IF(K12>0.0001,IF(K12>L12,0,1),0)","v":0},174,"F",{"$f":"IF($O12 = \"F\",CONVERT($N12,\"F\",\"C\"),$N12)","v":78.888888888888886},{"$f":"IF(P12>0.01,VLOOKUP(A12,'[1]Marine Coating Limits'!$I$3:$L$4,3,FALSE),0)","v":190},{"$f":"IF(P12>0.001,IF(P12>Q12,1,0),0)","v":0},{"$f":"IF(ISBLANK(C12),\" \",IF((H12+K12+N12) >0.001,IF((J12+M12+R12)>=1,\"YES\",\"NO\"),\"INCOMPLETE INFORMATION\"))","v":"NO"},{"$f":"IF(ISBLANK(N12),0,IF(S12=\"YES\",0,IF(A12 = \"Equipment Cleaning\",1,0)))","v":1},"Contained Flushing: cleaning solvent is flushed or rinsed through equipment in a contained manner as described in 67.18(d)(3)(ii)",null,null,{"$f":"IF(ISBLANK(W12),0,V12*W12/100)","v":0},null,{"$f":"IF(ISBLANK(Y12),0,V12*Y12/100)","v":0}]
["Equipment Cleaning","Brenntag Pacific","INTERN'L THINNER","GT 4637",{"$f":"IF(ISBLANK(B13),\" \",CONCATENATE($A13,\": \",$B13,\" \",$C13,\" \",$D13))","v":"Equipment Cleaning: Brenntag Pacific INTERN'L THINNER GT 4637"},7.23,"lb/gal",{"$f":"IF($G13 = \"lb/gal\",($F13*120),$F13)","v":867.6},{"$f":"IF(H13>1,VLOOKUP($A13,'[1]Marine Coating Limits'!$I$3:$L$4,2,FALSE),0)","v":200},{"$f":"IF(H13>0.001,IF($H13>$I13,0,1),0)","v":0},5.6,{"$f":"IF(K13>0.01,VLOOKUP(A13,'[1]Marine Coating Limits'!$I$3:$L$4,4,FALSE),0)","v":20},{"$f":"IF(K13>0.0001,IF(K13>L13,0,1),0)","v":1},330,"F",{"$f":"IF($O13 = \"F\",CONVERT($N13,\"F\",\"C\"),$N13)","v":165.55555555555554},{"$f":"IF(P13>0.01,VLOOKUP(A13,'[1]Marine Coating Limits'!$I$3:$L$4,3,FALSE),0)","v":190},{"$f":"IF(P13>0.001,IF(P13>Q13,1,0),0)","v":0},{"$f":"IF(ISBLANK(C13),\" \",IF((H13+K13+N13) >0.001,IF((J13+M13+R13)>=1,\"YES\",\"NO\"),\"INCOMPLETE INFORMATION\"))","v":"YES"},{"$f":"IF(ISBLANK(N13),0,IF(S13=\"YES\",0,IF(A13 = \"Equipment Cleaning\",1,0)))","v":0},null,null,null,{"$f":"IF(ISBLANK(W13),0,V13*W13/100)","v":0},null,{"$f":"IF(ISBLANK(Y13),0,V13*Y13/100)","v":0}]
["Equipment Cleaning","Brenntag Pacific","Lacquer Wash","201-X",{"$f":"IF(ISBLANK(B14),\" \",CONCATENATE($A14,\": \",$B14,\" \",$C14,\" \",$D14))","v":"Equipment Cleaning: Brenntag Pacific Lacquer Wash 201-X"},622,"g/l",{"$f":"IF($G14 = \"lb/gal\",($F14*120),$F14)","v":622},{"$f":"IF(H14>1,VLOOKUP($A14,'[1]Marine Coating Limits'!$I$3:$L$4,2,FALSE),0)","v":200},{"$f":"IF(H14>0.001,IF($H14>$I14,0,1),0)","v":0},37.200000000000003,{"$f":"IF(K14>0.01,VLOOKUP(A14,'[1]Marine Coating Limits'!$I$3:$L$4,4,FALSE),0)","v":20},{"$f":"IF(K14>0.0001,IF(K14>L14,0,1),0)","v":0},133,"F",{"$f":"IF($O14 = \"F\",CONVERT($N14,\"F\",\"C\"),$N14)","v":56.111111111111107},{"$f":"IF(P14>0.01,VLOOKUP(A14,'[1]Marine Coating Limits'!$I$3:$L$4,3,FALSE),0)","v":190},{"$f":"IF(P14>0.001,IF(P14>Q14,1,0),0)","v":0},{"$f":"IF(ISBLANK(C14),\" \",IF((H14+K14+N14) >0.001,IF((J14+M14+R14)>=1,\"YES\",\"NO\"),\"INCOMPLETE INFORMATION\"))","v":"NO"},{"$f":"IF(ISBLANK(N14),0,IF(S14=\"YES\",0,IF(A14 = \"Equipment Cleaning\",1,0)))","v":1},"Contained Flushing: cleaning solvent is flushed or rinsed through equipment in a contained manner as described in 67.18(d)(3)(ii)",null,null,{"$f":"IF(ISBLANK(W14),0,V14*W14/100)","v":0},null,{"$f":"IF(ISBLANK(Y14),0,V14*Y14/100)","v":0}]
["Equipment Cleaning","Cumberland Products","Advantage 100 Fast Dry Acrylic Lacquer Thinner",100,{"$f":"IF(ISBLANK(B15),\" \",CONCATENATE($A15,\": \",$B15,\" \",$C15,\" \",$D15))","v":"Equipment Cleaning: Cumberland Products Advantage 100 Fast Dry Acrylic Lacquer Thinner 100"},4,"lb/gal",{"$f":"IF($G15 = \"lb/gal\",($F15*120),$F15)","v":480},{"$f":"IF(H15>1,VLOOKUP($A15,'[1]Marine Coating Limits'!$I$3:$L$4,2,FALSE),0)","v":200},{"$f":"IF(H15>0.001,IF($H15>$I15,0,1),0)","v":0},116,{"$f":"IF(K15>0.01,VLOOKUP(A15,'[1]Marine Coating Limits'!$I$3:$L$4,4,FALSE),0)","v":20},{"$f":"IF(K15>0.0001,IF(K15>L15,0,1),0)","v":0},133,"F",{"$f":"IF($O15 = \"F\",CONVERT($N15,\"F\",\"C\"),$N15)","v":56.111111111111107},{"$f":"IF(P15>0.01,VLOOKUP(A15,'[1]Marine Coating Limits'!$I$3:$L$4,3,FALSE),0)","v":190},{"$f":"IF(P15>0.001,IF(P15>Q15,1,0),0)","v":0},{"$f":"IF(ISBLANK(C15),\" \",IF((H15+K15+N15) >0.001,IF((J15+M15+R15)>=1,\"YES\",\"NO\"),\"INCOMPLETE INFORMATION\"))","v":"NO"},{"$f":"IF(ISBLANK(N15),0,IF(S15=\"YES\",0,IF(A15 = \"Equipment Cleaning\",1,0)))","v":1},"Closed Container: equipment or parts are cleaned in a container which is only opened when being accessesed for adding, cleaning, or removing application equipment and parts are allowed to drain or drip prior to removal, as described in 67.18(d)(3)(iii)",null,null,{"$f":"IF(ISBLANK(W15),0,V15*W15/100)","v":0},null,{"$f":"IF(ISBLANK(Y15),0,V15*Y15/100)","v":0}]
{"$rows_left_out":93}
{"sheet":"4. Adhesive Reporting Form","index":3,"n_rows":82,"n_cols":22,"rows_kept":82,"cut":false,"hidden":false,"merged":[[5,11,5,13],[10,7,10,8],[12,7,12,8],[11,7,11,8],[10,11,10,14],[11,13,11,14],[7,7,9,13]]}
[null,"  "]
[null,"rev 14JAN13"]
[null,null,null,null,null,null,null,null,null,null,"Reporting Month"]
[null,null,null,null,null,null,null,null,null,null,"Reporting Year"]
[]
[null,null,null,null,null,null,null,"MONTHLY ADHESIVE USAGE FORM",null,null,"Facility where work occurred:"]
[]
[null,null,null,null,null,null,null,"I certify that the above is an accurate and complete accounting of all adhesives applied by the undersigned company at the facility listed above during the reporting month.  I further certify that all adhesive were applied in compliance with SDAPCD Rule 67.21 and in conformance with applicable permit requirements. "]
[]
[]
[null,null,null,null,null,null,"Company Name:",{"$f":"'1. INSTRUCTIONS'!B6","v":0},null,null,"Report Prepared by:",{"$f":"'1. INSTRUCTIONS'!B9","v":0}]
[null,null,null,null,null,null,"Address: ",{"$f":"'1. INSTRUCTIONS'!B7","v":0},null,null,"Phone:",{"$f":"'1. INSTRUCTIONS'!H8","v":0},"E-Mail:",{"$f":"'1. INSTRUCTIONS'!H9","v":0}]
[null,null,null,null,null,null,"City, Zip:",{"$f":"'1. INSTRUCTIONS'!B8","v":0},null,null,"Report Date:"]
[]
[]
{"$rows_left_out":68}
{"sheet":"5. Solvent Reprting Form","index":4,"n_rows":87,"n_cols":17,"rows_kept":87,"cut":false,"hidden":false,"merged":[[83,9,83,12],[0,4,1,5],[7,4,9,11],[11,5,11,6],[11,9,11,11]]}
[null,null,null,null,"Name of Company Perfoming Marine Coating:",null,"Company Name"]
[null,null,null,null,null,null,{"$f":"'1. INSTRUCTIONS'!B6","v":0},null,"Reporting Month:",null,null,"Reporting Year:"]
[]
[]
[]
[]
[null,null,null,null,"Report Certification:"]
[null,null,null,null,"I certify that this report contains an accurate and complete accounting of all marine coating activities performed by the above-listed company at the listed government installation during the reporting month.  I further certify that the company listed above employs a system to verify the as-supplied VOC content of each batch of coating  used to ensure that the VOC content does not exceed the VOC limits established in San Diego Air Pollution Control District Rule 67.18 (and 40 CFR Part 63, where applicable).  I certify that no paint products were thinned and that the values shown above are an accurate representation of the as-applied VOC content of the products used. "]
[]
[]
[]
[null,null,null,null,"Name:",null,null,null,"Date:"]
[]
[]
[null,"Hiring Agency","Company Name","Prime Contractor","Vessel Name","Date Used","Solvent Products Used","VOC g/l","Vapor Pressure mm/hg","Initial boiling Point °C","Gallons of Solvent Issued","Gallons of Solvent to Waste Disposal           ","Total Gallons Used ","Pounds of VOCs Emitted","Pounds of n-butanol Emitted","Pounds of Xylenes Emitted"]
{"$rows_left_out":73}
{"sheet":"6. APCD Limits","index":5,"n_rows":137,"n_cols":6,"rows_kept":137,"cut":false,"hidden":false,"merged":[[56,1,61,1],[56,5,61,5],[35,5,47,5],[48,5,52,5],[53,5,55,5]]}
[]
[]
[]
[]
[]
[]
[]
[]
["Source:  San Diego Air Pollution Control District Rule 67.21 Effective 11/14/2008"]
[null,"SDAPCD Rule 67.21","Compound Category Name","Product Category","VOC Limit (g/l)","Comment"]
[null,"(d)(1)(i) General Adhesive Materials, (A) Architectural Products",{"$f":"CONCATENATE(B11,\", \",D11)","v":"(d)(1)(i) General Adhesive Materials, (A) Architectural Products, Architectural sealant"},"Architectural sealant",250]
[null,{"$f":"$B$11","v":"(d)(1)(i) General Adhesive Materials, (A) Architectural Products"},"(d)(1)(i) General Adhesive Materials, (A) Architectural Products, Architectural sealant primer for non-porous materials","Architectural sealant primer for non-porous materials",250]
[null,{"$f":"$B$11","v":"(d)(1)(i) General Adhesive Materials, (A) Architectural Products"},"(d)(1)(i) General Adhesive Materials, (A) Architectural Products, Architectural sealant primer for porous materials","Architectural sealant primer for porous materials",775]
[null,"(d)(1)(i) General Adhesive Materials, (A) Architectural Products","(d)(1)(i) General Adhesive Materials, (A) Architectural Products, Ceramic tile installation adhesive","Ceramic tile installation adhesive",65]
[null,"(d)(1)(i) General Adhesive Materials, (A) Architectural Products","(d)(1)(i) General Adhesive Materials, (A) Architectural Products, Cove base installation adhesive","Cove base installation adhesive",50]
{"$rows_left_out":123}
{"sheet":"Drop Down List 2","index":6,"n_rows":272,"n_cols":11,"rows_kept":272,"cut":false,"hidden":true,"merged":[]}
[]
[]
[]
["Manufacturer's Name",null,"VOC Units",null,"Application Method",null,"Month",null,null,null,"VOC Control for Equipment Cleaning Solvents"]
["American Safety Technologies",null,"lb/gal",null,"Brush/Roll",null,"Jan",null,null,null,"Enclosed Parts Cleaning: a system is used that totally encloses the component parts being cleaned during the washing, rinsing, and draining process, as described in 67.21(d)(3)(vi)"]
["Ameron Protective Coatings",null,"g/l",null,"Airless",null,"Feb",null,null,null,"Contained Flushing: cleaning solvent is flushed or rinsed through equipment in a contained manner as described in 67.21(d)(3)(iv)"]
["Belzona Inc",null,null,null,"HVLP",null,"Mar",null,null,null,"Closed Container: equipment or parts are cleaned in a container which is only opened when being accessesed for adding, cleaning, or removing application equipment and parts are allowed to drain or drip prior to removal, as described in 67.21(d)(3)(v)"]
["Brenntag Pacific",null,null,null,"Conventional",null,"Apr"]
["Carboline",null,"Temperature Units",null,null,null,"May"]
["Devoe Coatings",null,"F",null,null,null,"Jun"]
["Euronavy",null,"C",null,null,null,"Jul"]
["Glidden",null,null,null,null,null,"Aug"]
["Hempel",null,null,null,null,null,"Sep",null,null,null,"Government Installations"]
["International Paint (USA) Inc.",null,null,null,null,null,"Oct",null,null,null,"AMPHIB"]
["Pervo Paint",null,null,null,null,null,"Nov",null,null,null,"MCBCP"]
{"$rows_left_out":258}
{"sheet":"Drop Down list 1","index":7,"n_rows":8,"n_cols":2,"rows_kept":8,"cut":false,"hidden":true,"merged":[]}
[]
[]
[null,"Government Installations"]
[null,"AMPHIB"]
[null,"MCBCP"]
[null,"NBC"]
[null,"NBPL"]
[null,"NBSD"]